{"text_format":"1","workbook":"xlsx","n_sheets":6,"sheets":["Samenvatting","INPUT_OUTPUT","Grafiek","Berekening","Transportberekening","Versies"],"not_rendered":{"charts":1,"images":5,"macros":1,"external_links":1,"defined_names":106,"comments":3,"pivot_tables":0},"unopened":[],"bounds":{"document_bytes":16777216,"sheet_cells":100000,"rows_first":2000,"rows_last":500,"rows_between":2000,"halvings":0,"cell_chars":16384,"cell_head_chars":4096},"cells_cut":0,"cells_raw":0,"read":"whole","date_system":"1900"}

{"sheet":"Samenvatting","index":0,"n_rows":0,"n_cols":0,"rows_kept":0,"cut":false,"hidden":false,"merged":[]}

{"sheet":"INPUT_OUTPUT","index":1,"n_rows":54,"n_cols":19,"rows_kept":54,"cut":false,"hidden":false,"merged":[[29,7,30,11],[19,13,30,16],[6,8,6,10],[22,1,22,3],[5,2,5,3],[5,5,5,7],[10,14,12,16],[27,7,28,11],[1,1,2,1],[1,14,1,16],[4,2,4,3],[4,5,4,7],[4,12,4,13],[50,7,52,7],[6,2,6,3],[22,11,23,12],[50,2,52,2],[50,3,52,3],[50,4,52,4],[50,5,52,5],[50,6,52,6],[50,12,50,16],[39,8,40,8],[39,9,40,10],[44,8,45,8],[44,9,45,10],[42,12,43,16],[44,12,46,16],[26,5,26,7]]}
["Berekening"]
["Transportberekening","INPUT",null,null,null,null,null,null,null,null,null,null,null,null,"check laatste versie hier"]
[null,null,null,null,null,null,null,null,null,null,null,null,null,null,null,null,"versie 2.1 14/05/2025"]
[null,"ADMINISTRATIEVE GEGEVENS VAN HET BEMALINGSTRAJECT"]
[null,"OMV nummer",null,null,"straat",null,null,null,"nr",null,null,"gemeente",null,null,null,"Startdatum"]
[null,"aanvrager",null,null,"Naam streng",null,null,null,null,null,null,null,null,null,null,{"$f":"IF(ISBLANK(Q5),\"Vul de startdatum in\",\"\")","v":"Vul de startdatum in"}]
[null,"ingevuld door",null,null,"datum",{"$f":"TODAY()","v":"2025-05-15"},null,null,{"$f":"IF(OR(ISBLANK(C5),ISBLANK(F5),ISBLANK(J5),ISBLANK(M5),ISBLANK(C6),ISBLANK(C7)),\"Vul alle administratieve gegevens in. \",\"\")","v":"Vul alle administratieve gegevens in. "}]
[]
[null,"LIGGING","Gelegen in beschermd duingebied?",null,null,null,null,null,null,null,null,null,"zie DOV themaviewer bemalingen"]
[null,null,"Gelegen in waterwingebied of beschermingszone Type I of II?",null,null,null,null,null,null,null,null,null,{"$f":"IF(OR(ISBLANK(J9),ISBLANK(J10),ISBLANK(J11),ISBLANK(J12)),\"Vul alle vragen met betrekking tot de ligging in. \",\"\")","v":"Vul alle vragen met betrekking tot de ligging in. "}]
[null,null,"Afstand tot speciale beschermingszones (habitatrichtlijngebied, vogelrichtlijngebied)",null,null,null,null,null,null,null,"in meter",null,{"$f":"IF(ISBLANK(J11),\"<----  indien leeg: wordt beschouwd als IN speciale beschermingszone!\",\"\")","v":"<----  indien leeg: wordt beschouwd als IN speciale beschermingszone!"}]
[null,null,"Afstand tot VEN gebied",null,null,null,null,null,null,null,"in meter"]
[]
[]
[null,"GEGEVENS OVER HET TRAJECT EN DE ONDERGROND"]
[null,null,null,null,"Lijntraject:",null,null,null,null,null,null,null,null,"Maaiveld",null,"mTAW"]
[null,null,null,null,"breedte",null,"m"]
[null,{"$f":"IF($F$18<25,\"Lengte moet groter zijn dan 25 m!\",IF(Berekening!G73=1,\"Radiale stroming is aanzienlijk!\",IF($F$18>300,\"Traject is te lang, werk in subtrajecten!\",\"\")))","v":"Lengte moet groter zijn dan 25 m!"},null,null,"lengte",null,"m",null,null,null,null,null,null,"Watertafel / oorspronkelijk peil",null,"m-mv"]
[null,null,"s",null,"diepte",null,"m-mv"]
[null,null,null,null,null,null,null,null,null,null,null,null,null,{"$f":"IF(OR(ISBLANK(F17),ISBLANK(F18),ISBLANK(F19),ISBLANK(O16),ISBLANK(O18),ISBLANK(F24),ISBLANK(F25),ISBLANK(F26),ISBLANK(F30),ISBLANK(G24),ISBLANK(G26),ISBLANK(G28),ISBLANK(G30)),\"Vul al de gele cellen in\",CONCATENATE(+IF(INDIRECT(A1&\"!F13\")<INDIRECT(A1&\"!F12\"),\"Watertafel boven maaiveld. \",\"\"),IF(INDIRECT(A1&\"!F17\")<INDIRECT(A1&\"!F15\"),\"Filter minder diep dan gewenste verlaging. \",\"\"),IF(INDIRECT(A1&\"!F17\")>INDIRECT(A1&\"!F18\"),\"Filter dieper dan top ondoorlatende basis. Pas filterdiepte of peil ondoorlatende basis aan. \",\"\"),IF(INDIRECT(A1&\"!F15\")<INDIRECT(A1&\"!F13\"),\"Gewenst waterpeil (verlaging) minder diep dan oorspronkelijk peil. Geen bemaling nodig. \",\"\"),IF(INDIRECT(A1&\"!F15\")<INDIRECT(A1&\"!H14\"),\"Gewenst waterpeil (verlaging) minder diep dan 0,5 m onder de diepste uitgraving. Pas de gewenste verlaging aan. \",\"\"),IF(INDIRECT(A1&\"!F14\")<INDIRECT(A1&\"!F13\"),\"De uitgravingsdiepte bevindt zich boven de oorspronkelijke watertafel. Geen bemaling nodig. \",\"\"),IF(INDIRECT(A1&\"!F18\")<INDIRECT(A1&\"!F12\"),\"De top van de ondoorlatende basis bevindt zich hoger dan het maaiveld.  \",\"\"),IF(INDIRECT(A1&\"!F15\")>INDIRECT(A1&\"!F18\"),\"Gewenste verlaging dieper dan top ondoorlatende basis. \",\"\"),IF(AND(ISNUMBER(K25),K25<1),\"De retardatiefactor moet minstens 1 zijn. \",\"\"),IF(AND(ISNUMBER(K24),K24<0.05),\"De porositeit is steeds een waarde tussen 0,05 en 0,3. \",\"\"),IF(AND(ISNUMBER(K24),K24>0.3),\"De porositeit is steeds een waarde tussen 0,05 en 0,3. \",\"\"),\"\"))","v":"Vul al de gele cellen in"}]
{"$rows_left_out":35}
{"sheet":"Grafiek","index":2,"n_rows":0,"n_cols":0,"rows_kept":0,"cut":false,"hidden":false,"merged":[]}

{"sheet":"Berekening","index":3,"n_rows":116,"n_cols":18,"rows_kept":116,"cut":false,"hidden":false,"merged":[[59,1,59,3]]}
["INPUT_OUTPUT"]
[null,null,null,null,null,null,null,null,null,null,null,null,null,{"$f":"CONCATENATE(L2,\" \",M2)","v":" "}]
[null,"OMZETTINNG INPUT naar m-mv en m/d, bepalen toeslag onvolkomen bron",null,null,null,null,null,"codetabel",null,null,null,null,null,{"$f":"CONCATENATE(L3,\" \",M3)","v":" "}]
[null,"breedte bouwput",{"$f":"IF(ISNUMBER(INDIRECT(A1&\"!F17\")),INDIRECT(A1&\"!F17\"))","v":false},"m",null,null,null,"eenheid","factor naar m/d",null,null,null,"grondsoort",{"$f":"CONCATENATE(L4,\" \",M4)","v":" grondsoort"},"doorlatendheid (m/dag)",null,"Bergingscoëfficiënt","Referentie"]
[null,"lengte bouwput",{"$f":"IF(ISNUMBER(INDIRECT(A1&\"!F18\")),INDIRECT(A1&\"!F18\"),\"\")","v":""},"m",null,null,null,"m/d",1]
[null,null,null,null,null,null,null,"m/s",{"$f":"3600*24","v":86400},null,null,"01","zware klei",{"$f":"CONCATENATE(L6,\" - \",M6,\" (\",O6,\" m/d)\")","v":"01 - zware klei (0,0001 m/d)"},1E-4,null,2.0000000000000001E-4,"Fm Boom, Lebbe et al. 2004-DOV"]
[null,"duur bemaling",{"$f":"INDIRECT(A1&\"!F25\")","v":0},"dagen",null,null,null,null,null,null,null,"02","potklei",{"$f":"CONCATENATE(L7,\" - \",M7,\" (\",O7,\" m/d)\")","v":"02 - potklei (0,001 m/d)"},1E-3,null,2.0000000000000001E-4,"Fm Boom, Lebbe et al. 2004-DOV"]
[null,"type sediment",{"$f":"IF(ISBLANK(INDIRECT(A1&\"!F27\")),\"\",INDIRECT(A1&\"!F27\"))","v":""},null,null,null,null,null,null,null,null,"03","matig zware klei","03 - matig zware klei (0,01 m/d)",0.01,null,0.02,"Fetter,2001-gemiddelde waarde  klei"]
[null,"K (doorlatendhied)",{"$f":"IF(ISBLANK(INDIRECT(A1&\"!F28\")),\"\",INDIRECT(A1&\"!F28\"))","v":""},{"$f":"INDIRECT(A1&\"!G28\")","v":"m/d"},"-->",{"$f":"IF(k_m_d<>\"\",k_m_d*(IF(D9=\"m/d\",1,86400)),LOOKUP(sediment_type,N6:N42,O6:O42))","v":{"$error":"#N/A"}},"m/d","keuzetabel","keuzetabel",null,null,"04","zandige klei","04 - zandige klei (0,05 m/d)",0.05,null,7.0000000000000007E-2,"Fetter,2001-gemiddelde waarde zandig klei"]
[null,"Berging",{"$f":"IF(ISBLANK(INDIRECT(A1&\"!F29\")),\"\",INDIRECT(A1&\"!F29\"))","v":""},null,null,{"$f":"IF(sy_input<>\"\",sy_input,LOOKUP(sediment_type,N6:N42,Q6:Q42))","v":{"$error":"#N/A"}},null,"mTAW",null,null,null,"05","keileem","05 - keileem (0,05 m/d)",0.05,null,0.03,"Fetter 2001, min waarde silte"]
[null,null,null,null,null,null,null,"m-mv","JA",null,null,"06","veen","06 - veen (0,01 m/d)",0.01,"0.001 - 0.1",0.2]
[null,"maaiveld",{"$f":"INDIRECT(A1&\"!O16\")","v":0},{"$f":"INDIRECT(A1&\"!P16\")","v":"mTAW"},"-->",{"$f":"0","v":0},"m-mv",null,"NEEN",null,null,"07","kleiig veen","07 - kleiig veen (0,005 m/d)",5.0000000000000001E-3,null,0.2]
[null,"Peil in rust",{"$f":"INDIRECT(A1&\"!O18\")","v":0},{"$f":"INDIRECT(A1&\"!P18\")","v":"m-mv"},"-->",{"$f":"IF(D13=\"mTAW\",maaiveld-C13,C13)","v":0},"m-mv",null,null,null,null,"08","sterk zandig veen","08 - sterk zandig veen (0,05 m/d)",0.05,null,0.2]
[null,"Onderkant bouwput",{"$f":"INDIRECT(A1&\"!F19\")","v":0},{"$f":"INDIRECT(A1&\"!G19\")","v":"m-mv"},"-->",{"$f":"IF(D14=\"mTAW\",maaiveld-C14,C14)","v":0},"m-mv",{"$f":"+F14+0.5","v":0.5},"m-mv",null,null,"09","leem/löss","09 - leem/löss (0,05 m/d)",0.05,null,0.18,"Fetter,2001-gemiddelde waarde silt"]
[null,"s (gewenste verlaging)",{"$f":"INDIRECT(A1&\"!F24\")","v":0},{"$f":"INDIRECT(A1&\"!G24\")","v":"m-mv"},"-->",{"$f":"IF(D15=\"mTAW\",maaiveld-C15,C15)","v":0},"m-mv",null,null,null,null,"10","zandige leem","10 - zandige leem (0,3 m/d)",0.3,null,0.19,"Fetter,2001-max waarde silt"]
[null,"s (gewenste verlaging)",{"$f":"F15-F13","v":0},{"$f":"IF(verlaging<=0,\"negatieve verlaging: pas peilen aan!\",\"m\")","v":"negatieve verlaging: pas peilen aan!"},null,null,null,null,null,null,null,"11","lichte zavel","11 - lichte zavel (0,5 m/d)",0.5,null,0.1,"Fetter,2001-min fijn zand"]
[null,"diepte filter",{"$f":"INDIRECT(A1&\"!F26\")","v":0},{"$f":"INDIRECT(A1&\"!G26\")","v":"m-mv"},"-->",{"$f":"IF(D17=\"mTAW\",maaiveld-C17,C17)","v":0},"m-mv",null,null,null,null,"12","uiterst fijn zand (kleiig)","12 - uiterst fijn zand (kleiig) (0,5 m/d)",0.5,null,0.1,"Fetter,2001-min fijn zand"]
[null,"ondoorlatende basis",{"$f":"INDIRECT(A1&\"!F30\")","v":0},{"$f":"INDIRECT(A1&\"!G30\")","v":"m-mv"},"-->",{"$f":"IF(D18=\"mTAW\",maaiveld-C18,C18)","v":0},"m-mv",null,null,null,null,"13","uiterst fijn zand (zwak kleiig)","13 - uiterst fijn zand (zwak kleiig) (2 m/d)",2,null,0.1,"Fetter,2001-min fijn zand"]
[null,"H (beperkt tot onderkant filter)",{"$f":"MIN(F17,F18)-F13","v":0},"dikte verzadigde zone vanaf onderkant filter in m",null,null,null,null,null,null,null,"14","uiterst fijn zand (zuiver)","14 - uiterst fijn zand (zuiver) (3 m/d)",3,null,0.1,"Fetter,2001-min fijn zand"]
[null,"Dikte Aqufier",{"$f":"Basis-F13","v":0},"m",null,null,null,null,null,null,null,"15","zeer fijn zand (kleiig)","15 - zeer fijn zand (kleiig) (1 m/d)",1,null,0.21,"Fetter,2001-gemiddelde fijn zand"]
{"$rows_left_out":97}
{"sheet":"Transportberekening","index":4,"n_rows":502,"n_cols":11,"rows_kept":502,"cut":false,"hidden":false,"merged":[]}
["INPUT_OUTPUT","Berekening"]
["INPUT"]
[null,"Verontreiniging op (m rand)",{"$f":"INDIRECT(A1&\"!k23\")","v":0},null,null,"Effectieve porositeit",{"$f":"INDIRECT(B1&\"!C110\")","v":0},"Retardatiefactor",{"$f":"INDIRECT(B1&\"!C111\")","v":0}]
[]
[]
[null,null,null,null,null,null,null,null,"Sleuf bereikt na",{"$f":"IF(MAX(B9:B499)<INDIRECT(A1&\"!F25\"),MAX(B9:B499),\"\")","v":""},"dagen"]
["Berekening gradiënt volgens edelman",null,null,null,null,null,null,null,"Verplaatsing indien bouwput niet bereikt werd",{"$f":"IF(NOT(ISNUMBER($J$6)),$C$3 -LOOKUP(ROUND(INDIRECT($B$1&\"!C7\"),1),B9:B502,H9:H502))","v":{"$error":"#N/A"}},"m"]
[null,"tijd (dag)","afstand (m)","verlaging (m)","gradiënt (m/m)","snelheid (m/d) conservatief","verplaatsing op deze dag met retardatie","Nieuwe positie"]
[null,0.01,{"$f":"IF(ISNUMBER(B9),C3,\"\")","v":0},{"$f":"IF(AND(B9<INDIRECT($B$1&\"!$C$7\"),ISNUMBER(B9)),INDIRECT($B$1&\"!$C$16\")*ERFC(0.5*C9*SQRT(INDIRECT($B$1&\"!$F$10\")/(INDIRECT($B$1&\"!$F$9\")*INDIRECT($B$1&\"!$C$20\")*B9))),\"\")","v":""},{"$f":"(INDIRECT($B$1&\"!$F$15\") -D9)/C9","v":{"$error":"#VALUE!"}},{"$f":"IF(ISNUMBER(E9),E9*INDIRECT($B$1&\"!$F$9\")/$G$3,\"\")","v":""},{"$f":"IF(ISNUMBER(F9),F9*B9/$I$3,\"\")","v":""},{"$f":"IF(B9<INDIRECT($B$1&\"!$C$7\"),C9-G9,\"\")","v":""}]
[null,{"$f":"IF(ISNUMBER(B9),IF(AND(B9<INDIRECT($B$1&\"!$C$7\"),H9>0), B9+0.5,\"\"),\"\")","v":""},{"$f":"IF(ISNUMBER(B10),H9,\"\")","v":""},{"$f":"IF(AND(B10<INDIRECT($B$1&\"!$C$7\"),ISNUMBER(B10)),INDIRECT($B$1&\"!$C$16\")*ERFC(0.5*C10*SQRT(INDIRECT($B$1&\"!$F$10\")/(INDIRECT($B$1&\"!$F$9\")*INDIRECT($B$1&\"!$C$20\")*B10))),\"\")","v":""},{"$f":"(INDIRECT($B$1&\"!$F$15\") -D10)/C10","v":{"$error":"#VALUE!"}},{"$f":"IF(ISNUMBER(E10),E10*INDIRECT($B$1&\"!$F$9\")/$G$3,\"\")","v":""},{"$f":"IF(ISNUMBER(F10),F10*ABS(B9-B10)/$I$3,\"\")","v":""},{"$f":"IF(B10<INDIRECT($B$1&\"!$C$7\"),H9-G10,\"\")","v":""}]
[null,{"$f":"IF(ISNUMBER(B10),IF(AND(B10<INDIRECT($B$1&\"!$C$7\"),H10>0), B10+0.5,\"\"),\"\")","v":""},{"$f":"IF(ISNUMBER(B11),H10,\"\")","v":""},{"$f":"IF(AND(B11<INDIRECT($B$1&\"!$C$7\"),ISNUMBER(B11)),INDIRECT($B$1&\"!$C$16\")*ERFC(0.5*C11*SQRT(INDIRECT($B$1&\"!$F$10\")/(INDIRECT($B$1&\"!$F$9\")*INDIRECT($B$1&\"!$C$20\")*B11))),\"\")","v":""},{"$f":"(INDIRECT($B$1&\"!$F$15\") -D11)/C11","v":{"$error":"#VALUE!"}},{"$f":"IF(ISNUMBER(E11),E11*INDIRECT($B$1&\"!$F$9\")/$G$3,\"\")","v":""},{"$f":"IF(ISNUMBER(F11),F11*ABS(B10-B11)/$I$3,\"\")","v":""},{"$f":"IF(B11<INDIRECT($B$1&\"!$C$7\"),H10-G11,\"\")","v":""}]
[null,{"$f":"IF(ISNUMBER(B11),IF(AND(B11<INDIRECT($B$1&\"!$C$7\"),H11>0), B11+0.5,\"\"),\"\")","v":""},"",{"$f":"IF(AND(B12<INDIRECT($B$1&\"!$C$7\"),ISNUMBER(B12)),INDIRECT($B$1&\"!$C$16\")*ERFC(0.5*C12*SQRT(INDIRECT($B$1&\"!$F$10\")/(INDIRECT($B$1&\"!$F$9\")*INDIRECT($B$1&\"!$C$20\")*B12))),\"\")","v":""},{"$f":"(INDIRECT($B$1&\"!$F$15\") -D12)/C12","v":{"$error":"#VALUE!"}},{"$f":"IF(ISNUMBER(E12),E12*INDIRECT($B$1&\"!$F$9\")/$G$3,\"\")","v":""},"",{"$f":"IF(B12<INDIRECT($B$1&\"!$C$7\"),H11-G12,\"\")","v":""}]
[null,{"$f":"IF(ISNUMBER(B12),IF(AND(B12<INDIRECT($B$1&\"!$C$7\"),H12>0), B12+0.5,\"\"),\"\")","v":""},"",{"$f":"IF(AND(B13<INDIRECT($B$1&\"!$C$7\"),ISNUMBER(B13)),INDIRECT($B$1&\"!$C$16\")*ERFC(0.5*C13*SQRT(INDIRECT($B$1&\"!$F$10\")/(INDIRECT($B$1&\"!$F$9\")*INDIRECT($B$1&\"!$C$20\")*B13))),\"\")","v":""},{"$f":"(INDIRECT($B$1&\"!$F$15\") -D13)/C13","v":{"$error":"#VALUE!"}},{"$f":"IF(ISNUMBER(E13),E13*INDIRECT($B$1&\"!$F$9\")/$G$3,\"\")","v":""},"",{"$f":"IF(B13<INDIRECT($B$1&\"!$C$7\"),H12-G13,\"\")","v":""}]
[null,{"$f":"IF(ISNUMBER(B13),IF(AND(B13<INDIRECT($B$1&\"!$C$7\"),H13>0), B13+0.5,\"\"),\"\")","v":""},"",{"$f":"IF(AND(B14<INDIRECT($B$1&\"!$C$7\"),ISNUMBER(B14)),INDIRECT($B$1&\"!$C$16\")*ERFC(0.5*C14*SQRT(INDIRECT($B$1&\"!$F$10\")/(INDIRECT($B$1&\"!$F$9\")*INDIRECT($B$1&\"!$C$20\")*B14))),\"\")","v":""},{"$f":"(INDIRECT($B$1&\"!$F$15\") -D14)/C14","v":{"$error":"#VALUE!"}},{"$f":"IF(ISNUMBER(E14),E14*INDIRECT($B$1&\"!$F$9\")/$G$3,\"\")","v":""},"",{"$f":"IF(B14<INDIRECT($B$1&\"!$C$7\"),H13-G14,\"\")","v":""}]
[null,{"$f":"IF(ISNUMBER(B14),IF(AND(B14<INDIRECT($B$1&\"!$C$7\"),H14>0), B14+0.5,\"\"),\"\")","v":""},"",{"$f":"IF(AND(B15<INDIRECT($B$1&\"!$C$7\"),ISNUMBER(B15)),INDIRECT($B$1&\"!$C$16\")*ERFC(0.5*C15*SQRT(INDIRECT($B$1&\"!$F$10\")/(INDIRECT($B$1&\"!$F$9\")*INDIRECT($B$1&\"!$C$20\")*B15))),\"\")","v":""},{"$f":"(INDIRECT($B$1&\"!$F$15\") -D15)/C15","v":{"$error":"#VALUE!"}},{"$f":"IF(ISNUMBER(E15),E15*INDIRECT($B$1&\"!$F$9\")/$G$3,\"\")","v":""},"",{"$f":"IF(B15<INDIRECT($B$1&\"!$C$7\"),H14-G15,\"\")","v":""}]
[null,{"$f":"IF(ISNUMBER(B15),IF(AND(B15<INDIRECT($B$1&\"!$C$7\"),H15>0), B15+0.5,\"\"),\"\")","v":""},"",{"$f":"IF(AND(B16<INDIRECT($B$1&\"!$C$7\"),ISNUMBER(B16)),INDIRECT($B$1&\"!$C$16\")*ERFC(0.5*C16*SQRT(INDIRECT($B$1&\"!$F$10\")/(INDIRECT($B$1&\"!$F$9\")*INDIRECT($B$1&\"!$C$20\")*B16))),\"\")","v":""},{"$f":"(INDIRECT($B$1&\"!$F$15\") -D16)/C16","v":{"$error":"#VALUE!"}},{"$f":"IF(ISNUMBER(E16),E16*INDIRECT($B$1&\"!$F$9\")/$G$3,\"\")","v":""},"",{"$f":"IF(B16<INDIRECT($B$1&\"!$C$7\"),H15-G16,\"\")","v":""}]
[null,{"$f":"IF(ISNUMBER(B16),IF(AND(B16<INDIRECT($B$1&\"!$C$7\"),H16>0), B16+0.5,\"\"),\"\")","v":""},"",{"$f":"IF(AND(B17<INDIRECT($B$1&\"!$C$7\"),ISNUMBER(B17)),INDIRECT($B$1&\"!$C$16\")*ERFC(0.5*C17*SQRT(INDIRECT($B$1&\"!$F$10\")/(INDIRECT($B$1&\"!$F$9\")*INDIRECT($B$1&\"!$C$20\")*B17))),\"\")","v":""},{"$f":"(INDIRECT($B$1&\"!$F$15\") -D17)/C17","v":{"$error":"#VALUE!"}},{"$f":"IF(ISNUMBER(E17),E17*INDIRECT($B$1&\"!$F$9\")/$G$3,\"\")","v":""},"",{"$f":"IF(B17<INDIRECT($B$1&\"!$C$7\"),H16-G17,\"\")","v":""}]
[null,{"$f":"IF(ISNUMBER(B17),IF(AND(B17<INDIRECT($B$1&\"!$C$7\"),H17>0), B17+0.5,\"\"),\"\")","v":""},"",{"$f":"IF(AND(B18<INDIRECT($B$1&\"!$C$7\"),ISNUMBER(B18)),INDIRECT($B$1&\"!$C$16\")*ERFC(0.5*C18*SQRT(INDIRECT($B$1&\"!$F$10\")/(INDIRECT($B$1&\"!$F$9\")*INDIRECT($B$1&\"!$C$20\")*B18))),\"\")","v":""},{"$f":"(INDIRECT($B$1&\"!$F$15\") -D18)/C18","v":{"$error":"#VALUE!"}},{"$f":"IF(ISNUMBER(E18),E18*INDIRECT($B$1&\"!$F$9\")/$G$3,\"\")","v":""},"",{"$f":"IF(B18<INDIRECT($B$1&\"!$C$7\"),H17-G18,\"\")","v":""}]
[null,{"$f":"IF(ISNUMBER(B18),IF(AND(B18<INDIRECT($B$1&\"!$C$7\"),H18>0), B18+0.5,\"\"),\"\")","v":""},"",{"$f":"IF(AND(B19<INDIRECT($B$1&\"!$C$7\"),ISNUMBER(B19)),INDIRECT($B$1&\"!$C$16\")*ERFC(0.5*C19*SQRT(INDIRECT($B$1&\"!$F$10\")/(INDIRECT($B$1&\"!$F$9\")*INDIRECT($B$1&\"!$C$20\")*B19))),\"\")","v":""},{"$f":"(INDIRECT($B$1&\"!$F$15\") -D19)/C19","v":{"$error":"#VALUE!"}},{"$f":"IF(ISNUMBER(E19),E19*INDIRECT($B$1&\"!$F$9\")/$G$3,\"\")","v":""},"",{"$f":"IF(B19<INDIRECT($B$1&\"!$C$7\"),H18-G19,\"\")","v":""}]
[null,{"$f":"IF(ISNUMBER(B19),IF(AND(B19<INDIRECT($B$1&\"!$C$7\"),H19>0), B19+0.5,\"\"),\"\")","v":""},"",{"$f":"IF(AND(B20<INDIRECT($B$1&\"!$C$7\"),ISNUMBER(B20)),INDIRECT($B$1&\"!$C$16\")*ERFC(0.5*C20*SQRT(INDIRECT($B$1&\"!$F$10\")/(INDIRECT($B$1&\"!$F$9\")*INDIRECT($B$1&\"!$C$20\")*B20))),\"\")","v":""},{"$f":"(INDIRECT($B$1&\"!$F$15\") -D20)/C20","v":{"$error":"#VALUE!"}},{"$f":"IF(ISNUMBER(E20),E20*INDIRECT($B$1&\"!$F$9\")/$G$3,\"\")","v":""},"",{"$f":"IF(B20<INDIRECT($B$1&\"!$C$7\"),H19-G20,\"\")","v":""}]
{"$rows_left_out":483}
{"sheet":"Versies","index":5,"n_rows":17,"n_cols":2,"rows_kept":17,"cut":false,"hidden":false,"merged":[]}
["versies"]
["v1.0 20/10/2021","Versie zoals gepubliceerd op website VMM op 20/10/2021"]
[null,"Handleiding is in overeenstemming met deze versie"]
["v1.1 08/06/2022","Versie zoals gepubliceerd op website VMM op 10/06/2022"]
[null,"aanpassing cel B18 tabblad INPUT-OUTPUT"]
[null,"aanpassing bepalen rubriek en vergunningsklasse in tabblad SAMENVATTING"]
["V2.0 03/03/2025","aanpassingen aan nieuwe indelingsrubrieken volgens de grondwatertrein"]
[null,"kleine correcties in waarschuwingen"]
[null,"toevoeging waarschuwing ivm passende beoordeling en verscherpte natuurtoets"]
["v2.0 06/03/2025","geen meldingen over passende beoordeling bij niet-ingedeelde inrichting of klasse 3"]
[null,"geen meldingen over VEN-gebied bij niet-ingedeelde inrichting"]
[null,"link naar huidige rubriekenlijst en naar versie dd. 08/04/2025"]
[null,"tekening filter aangepast en verbetering aanduiding H"]
["v2.0 25/03/2025","macro van samenvatting volledig afgewerkt en aangepast aan nieuwe wetgeving, waarschuwingen aangepast in tabblad IN_OUTPUT"]
["v2.0 28/03/2025","link naar website VMM aangepast"]
[null,"Handleiding is in overeenstemming met deze versie"]
["v2.1 14/5/2025","kleine aanpassing in in-output tabblad"]