{"text_format":"1","workbook":"xlsx","n_sheets":6,"sheets":["Samenvatting","INPUT_OUTPUT","Grafiek","Berekening","Transportberekening","Versies"],"not_rendered":{"charts":1,"images":5,"macros":1,"external_links":1,"defined_names":106,"comments":3,"pivot_tables":0},"unopened":[],"bounds":{"document_bytes":16777216,"sheet_cells":100000,"rows_first":2000,"rows_last":500,"rows_between":2000,"halvings":0,"cell_chars":16384,"cell_head_chars":4096},"cells_cut":0,"cells_raw":0,"read":"whole","date_system":"1900"}

{"sheet":"Samenvatting","index":0,"n_rows":0,"n_cols":0,"rows_kept":0,"cut":false,"hidden":false,"merged":[]}

{"sheet":"INPUT_OUTPUT","index":1,"n_rows":54,"n_cols":19,"rows_kept":54,"cut":false,"hidden":false,"merged":[[29,7,30,11],[19,13,30,16],[6,8,6,10],[22,1,22,3],[5,2,5,3],[5,5,5,7],[10,14,12,16],[27,7,28,11],[1,1,2,1],[1,14,1,16],[4,2,4,3],[4,5,4,7],[4,12,4,13],[50,7,52,7],[6,2,6,3],[22,11,23,12],[50,2,52,2],[50,3,52,3],[50,4,52,4],[50,5,52,5],[50,6,52,6],[50,12,50,16],[39,8,40,8],[39,9,40,10],[44,8,45,8],[44,9,45,10],[42,12,43,16],[44,12,46,16],[26,5,26,7]]}
["Berekening"]
["Transportberekening","INPUT",null,null,null,null,null,null,null,null,null,null,null,null,"check laatste versie hier"]
[null,null,null,null,null,null,null,null,null,null,null,null,null,null,null,null,"versie 2.1 14/05/2025"]
[null,"ADMINISTRATIEVE GEGEVENS VAN HET BEMALINGSTRAJECT"]
[null,"OMV nummer",null,null,"straat",null,null,null,"nr",null,null,"gemeente",null,null,null,"Startdatum"]
[null,"aanvrager",null,null,"Naam streng",null,null,null,null,null,null,null,null,null,null,{"$f":"IF(ISBLANK(Q5),\"Vul de startdatum in\",\"\")","v":"Vul de startdatum in"}]
[null,"ingevuld door",null,null,"datum",{"$f":"TODAY()","v":"2025-05-15"},null,null,{"$f":"IF(OR(ISBLANK(C5),ISBLANK(F5),ISBLANK(J5),ISBLANK(M5),ISBLANK(C6),ISBLANK(C7)),\"Vul alle administratieve gegevens in. \",\"\")","v":"Vul alle administratieve gegevens in. "}]
[]
[null,"LIGGING","Gelegen in beschermd duingebied?",null,null,null,null,null,null,null,null,null,"zie DOV themaviewer bemalingen"]
[null,null,"Gelegen in waterwingebied of beschermingszone Type I of II?",null,null,null,null,null,null,null,null,null,{"$f":"IF(OR(ISBLANK(J9),ISBLANK(J10),ISBLANK(J11),ISBLANK(J12)),\"Vul alle vragen met betrekking tot de ligging in. \",\"\")","v":"Vul alle vragen met betrekking tot de ligging in. "}]
[null,null,"Afstand tot speciale beschermingszones (habitatrichtlijngebied, vogelrichtlijngebied)",null,null,null,null,null,null,null,"in meter",null,{"$f":"IF(ISBLANK(J11),\"<----  indien leeg: wordt beschouwd als IN speciale beschermingszone!\",\"\")","v":"<----  indien leeg: wordt beschouwd als IN speciale beschermingszone!"}]
[null,null,"Afstand tot VEN gebied",null,null,null,null,null,null,null,"in meter"]
[]
[]
[null,"GEGEVENS OVER HET TRAJECT EN DE ONDERGROND"]
[null,null,null,null,"Lijntraject:",null,null,null,null,null,null,null,null,"Maaiveld",null,"mTAW"]
[null,null,null,null,"breedte",null,"m"]
[null,{"$f":"IF($F$18<25,\"Lengte moet groter zijn dan 25 m!\",IF(Berekening!G73=1,\"Radiale stroming is aanzienlijk!\",IF($F$18>300,\"Traject is te lang, werk in subtrajecten!\",\"\")))","v":"Lengte moet groter zijn dan 25 m!"},null,null,"lengte",null,"m",null,null,null,null,null,null,"Watertafel / oorspronkelijk peil",null,"m-mv"]
[null,null,"s",null,"diepte",null,"m-mv"]
[null,null,null,null,null,null,null,null,null,null,null,null,null,{"$f":"IF(OR(ISBLANK(F17),ISBLANK(F18),ISBLANK(F19),ISBLANK(O16),ISBLANK(O18),ISBLANK(F24),ISBLANK(F25),ISBLANK(F26),ISBLANK(F30),ISBLANK(G24),ISBLANK(G26),ISBLANK(G28),ISBLANK(G30)),\"Vul al de gele cellen in\",CONCATENATE(+IF(INDIRECT(A1&\"!F13\")<INDIRECT(A1&\"!F12\"),\"Watertafel boven maaiveld. \",\"\"),IF(INDIRECT(A1&\"!F17\")<INDIRECT(A1&\"!F15\"),\"Filter minder diep dan gewenste verlaging. \",\"\"),IF(INDIRECT(A1&\"!F17\")>INDIRECT(A1&\"!F18\"),\"Filter dieper dan top ondoorlatende basis. Pas filterdiepte of peil ondoorlatende basis aan. \",\"\"),IF(INDIRECT(A1&\"!F15\")<INDIRECT(A1&\"!F13\"),\"Gewenst waterpeil (verlaging) minder diep dan oorspronkelijk peil. Geen bemaling nodig. \",\"\"),IF(INDIRECT(A1&\"!F15\")<INDIRECT(A1&\"!H14\"),\"Gewenst waterpeil (verlaging) minder diep dan 0,5 m onder de diepste uitgraving. Pas de gewenste verlaging aan. \",\"\"),IF(INDIRECT(A1&\"!F14\")<INDIRECT(A1&\"!F13\"),\"De uitgravingsdiepte bevindt zich boven de oorspronkelijke watertafel. Geen bemaling nodig. \",\"\"),IF(INDIRECT(A1&\"!F18\")<INDIRECT(A1&\"!F12\"),\"De top van de ondoorlatende basis bevindt zich hoger dan het maaiveld.  \",\"\"),IF(INDIRECT(A1&\"!F15\")>INDIRECT(A1&\"!F18\"),\"Gewenste verlaging dieper dan top ondoorlatende basis. \",\"\"),IF(AND(ISNUMBER(K25),K25<1),\"De retardatiefactor moet minstens 1 zijn. \",\"\"),IF(AND(ISNUMBER(K24),K24<0.05),\"De porositeit is steeds een waarde tussen 0,05 en 0,3. \",\"\"),IF(AND(ISNUMBER(K24),K24>0.3),\"De porositeit is steeds een waarde tussen 0,05 en 0,3. \",\"\"),\"\"))","v":"Vul al de gele cellen in"}]
[null,null,null,null,"tussenafstand filters",null,"m"]
[null,null,null,"H",null,null,null,null,null,null,"verontreiniging",null,null,null,null,null,null,null,{"$f":"+IF(INDIRECT(A1&\"!F17\")<INDIRECT(A1&\"!F15\"),\"Filter minder diep dan gewenste verlaging.\",\"\")","v":""}]
[null," (t.o.v. onderkant filterelement)",null,null,null,null,null,null,null,"afstand",null,"m vanaf rand van de\nbemaling"]
[null,null,null,null,"gewenste verlaging tot",null,"m-mv",null,null,"effectieve porositeit"]
[null,null,null,null,"duur bemaling",null,"dagen",null,null,"retardatiefactor"]
[null,null,null,null,"filterdiepte",null,"m-mv"]
[null,null,null,null,"grondsoort"]
[null,null,null,null,"OF doorlatendheid",null,"m/d",{"$f":"IF(SUM(ISBLANK(F28),ISBLANK(F27))=0,\"Vul 'grondsoort' OF 'doorlatendheid' en 'berging' in\",IF(SUM(ISBLANK(F27),ISBLANK(F29))=0,\"Vul 'grondsoort' OF 'doorlatendheid' en 'berging' in\",\"\"))","v":""}]
[null,null,null,null,"EN berging"]
[null,null,null,null,"top ondoorlatende basis:",null,"m-mv",{"$f":"IF((INDIRECT($A$1&\"!$F$17\")+10) < INDIRECT($A$1&\"!$F$18\"), \"Opgepast, ondoorlatende basis ligt dieper dan 10 m onder aanzetpeil bemalingselementen\",\"\")","v":""}]
[]
[]
[]
[null," OUTPUT"]
[]
[null,"DEBIET en INVLOEDSSTRAAL",null,null,null,null,null,null,null,null,null,null,"RUBRIEK",null,null,"Indelingslijst huidig"]
[null,null,null,null,null,null,null,null,null,null,null,null,null,null,null,"Indelingslijst 08/04/2025"]
[null,null,"Debiet en invloedsstraal bij het begin van de bemaling - gebaseerd op de formule van Edelman",null,null,null,null,null,null,null,null,null,"max dagdebiet",{"$f":"G41","v":{"$error":"#N/A"}},"m³/d"]
[null,null,"Invloedsstraal",null,{"$f":"INDIRECT(A1&\"!D66\")","v":{"$error":"#DIV/0!"}},"m",null,null,null,null,null,null,"totaal volume",{"$f":"IF(ISNUMBER(I40),$I$40+$I$45,\"\")","v":""},"m³"]
[null,null,"Initieel debiet",null,{"$f":"INDIRECT(A1&\"!C66\")/24","v":{"$error":"#N/A"}},"m³/u",null,null,{"$f":"IF(ISNUMBER(G41),INT(G41*5),\"\")","v":""},"volume in m³ voor eerste 5 dagen",null,null,"rubriek(en)",{"$f":"IF(AND(ISNUMBER($G$41),ISNUMBER($G$46)),\nIF($M$10=\"\",\nIF(OR(AND(INDIRECT($A$1&\"!$F$14\")>2.5,$J$10=\"JA\"),AND(INDIRECT($A$1&\"!$F$17\")>2.5,$J$10=\"JA\")),\"UITGRAVING en/of BORING DIEPER DAN 2,5 m IS VERBODEN\",\nCONCATENATE(\nIF(AND($N$38<1000,$N$39<10000,INDIRECT(A1&\"!F15\")<=4,$F$25<=14),\"Niet ingedeeld\",\"\"),\nIF(AND(OR($N$38>=1000,$N$39>=10000,INDIRECT(A1&\"!F15\")>4,$F$25>14),$N$39<=30000),\"53.2.1°\",\"\"),\nIF(AND($N$39>30000,$N$39<=180000,INDIRECT(A1&\"!F15\")>4),\"53.2.2°b)\",\"\"),\nIF(AND($N$39>30000,$N$39<=180000,INDIRECT(A1&\"!F15\")<=4,N38<=1000),\"53.2.2°a)1°\",\"\"),\nIF(AND($N$39>30000,$N$39<=180000,INDIRECT(A1&\"!F15\")<=4,N38>1000),\"53.2.2°a)2°\",\"\"),\nIF($N$39>180000,\"53.2.3°\",\"\"),\nIF(AND($N$38>=2500,$J$11>$E$44,$J$9=\"NEEN\"),\" en 53.11.1°\",\"\"),\nIF(AND(OR($J$9=\"JA\",$J$11<$E$44),$G$41>=1000),\" en 53.11.2°\",\"\"),)),\"Vul gele cellen in bij 'Ligging bemaling'\"),\"\")","v":""}]
[null,null,null,null,null,null,{"$f":"INDIRECT(A1&\"!C66\")","v":{"$error":"#N/A"}},"m³/d",null,null,null,null,"klasse",{"$f":"IF(AND(ISNUMBER($G$41),ISNUMBER($G$46)),\nIF(AND($F$24>2.5,$J$10=\"JA\"),\"VERBODEN\",\nMIN(\nIF(AND($N$38<1000,$N$39<10000,INDIRECT(A1&\"!F15\")<=4,$F$25<=14),,99),\nIF(AND($N$39<=30000,$N$38<2500),3,99),\nIF(AND($N$39>30000,$N$39<=180000,INDIRECT(A1&\"!F15\")>4,$N$38<2500),2,99),\nIF(AND($N$39>30000,$N$39<=180000,INDIRECT(A1&\"!F15\")<=4,$N$38<=1000,$N$38<2500),3,99),\nIF(AND($N$39>30000,$N$39<=180000,INDIRECT(A1&\"!F15\")<=4,$N$38>1000,$N$38<2500),2,99),\nIF(AND($N$39>180000,$N$38<2500),1,99),\nIF(AND($N$38>=2500,$J$11>$E$44,$J$9=\"NEEN\"),1,99),\nIF(AND(OR($J$9=\"JA\",$J$11<$E$44),$N$38>=1000),1,99))),\"\")","v":""}]
[]
[null,null,"Debiet en invloedsstraal op het einde van de bemaling - gebaseerd op de formule van Edelman",null,null,null,null,null,null,null,null,null,{"$f":"IF(AND(ISNUMBER($G$41),ISNUMBER($G$46)),\nCONCATENATE(IF($N$39>10000000,\"WAARSCHUWING: Project-MER vereist.\n\",\"\"),IF(AND($N$38>1000,$J$9=\"JA\",$N$39<10000000),\"WAARSCHUWING: Project-MER of ontheffingsnota vereist omwille van ligging in kustduinen en max dagdebiet > 1000 m³/d.\",\"\"),IF(N40=\"Niet ingedeeld\",\"WAARSCHUWING: Indien de bemaling uit meerdere strengen bestaat, is de bemaling mogelijk wel ingedeeld. Controleer steeds het tabblad 'Samenvatting'.\",\"\"),IF(AND($N$38>1000,$E$44>$J$11,$N$39<10000000),\"WAARSCHUWING: Project-MER of ontheffingsnota noodzakelijk omdat er mogelijk een betekenisvolle impact op speciale beschermingszone kan zijn.\",\"\"),IF(AND($N$38>=2500,E44<J11,$J$9=\"NEEN\"),\"WAARSCHUWING: Project-MER of ontheffingsnota vereist omwille van max dagdebiet > 2500 m³/d.\",\"\")))","v":false}]
[null,null,"Invloedsstraal",null,{"$f":"INDIRECT(A1&\"!C49\")","v":{"$error":"#DIV/0!"}},"m (met verlaging = 5 cm)"]
[null,null,"Debiet",null,{"$f":"INDIRECT(A1&\"!E70\")/(24)","v":{"$error":"#N/A"}},"m³/u",null,null,{"$f":"IF(ISNUMBER(G46),INT(G46*(F25-5)),\"\")","v":""},"volume in m³ resterende duur",null,null,{"$f":"IF(AND(ISNUMBER($G$41),ISNUMBER($G$46)),CONCATENATE(IF(AND($J$11<$E$44,OR($N$41=2,$N$41=1)),\"WAARSCHUWING: Invloedstraal tot in speciale beschermingszone dus passende beoordeling nodig.\",\"\"),IF(AND($J$12<$E$44,OR($N$41=1,$N$41=2,$N$41=3)),\"WAARSCHUWING: Invloedstraal tot in VEN gebied dus verscherpte natuurtoets nodig.\",\"\")),\"\")","v":""}]
[null,null,null,null,null,null,{"$f":"INDIRECT(A1&\"!E70\")","v":{"$error":"#N/A"}},"m³/d"]
[]
[]
[]
[null,"VERLAGING OP EEN AFSTAND",null,null,null,null,null,null,null,null,null,null,"VERPLAATSING VERONTREINIGING"]
[null,null,"Tijdstip (dagen)","Afstand tot rand sleuf (m)","H (verzadigde\n dikte t.o.v. onderkant filter in m)","Peil (mTAW)","verlaging s t.o.v. oorspr. peil (m)","Peil (m-mv)"]
[null,null,null,null,null,null,null,null,null,null,null,null,{"$f":"IF(AND(NOT(ISBLANK($F$25)),(ISNUMBER(INDIRECT(A2&\"!$J$7\")))),CONCATENATE(\"Na \",$F$25,\" dagen verplaatst de verontreiniging zich over een afstand van \",ROUND(INDIRECT(A2&\"!J7\"),2),\" m\",\"\"),\"\")","v":""}]
[null,null,null,null,null,null,null,null,null,null,null,null,{"$f":"IF(NOT(ISBLANK($F$25)),IF(ISNUMBER(INDIRECT(A2&\"!$J$6\")),CONCATENATE(\"De verontreiniging bereikt de sleuf na \", ROUND(INDIRECT(A2&\"!$J$6\"),2), \" dagen\"), \"De verontreiniging bereikt de sleuf niet binnen de voorziene bemalingsduur\"),\"\")","v":""}]
[null,null,null,null,{"$f":"INDIRECT(A1&\"!F104\")","v":{"$error":"#N/A"}},{"$f":"INDIRECT(A1&\"!F102\")","v":{"$error":"#N/A"}},{"$f":"INDIRECT(A1&\"!F101\")","v":{"$error":"#N/A"}},{"$f":"INDIRECT(A1&\"!F103\")","v":{"$error":"#N/A"}}]

{"sheet":"Grafiek","index":2,"n_rows":0,"n_cols":0,"rows_kept":0,"cut":false,"hidden":false,"merged":[]}

{"sheet":"Berekening","index":3,"n_rows":116,"n_cols":18,"rows_kept":116,"cut":false,"hidden":false,"merged":[[59,1,59,3]]}
["INPUT_OUTPUT"]
[null,null,null,null,null,null,null,null,null,null,null,null,null,{"$f":"CONCATENATE(L2,\" \",M2)","v":" "}]
[null,"OMZETTINNG INPUT naar m-mv en m/d, bepalen toeslag onvolkomen bron",null,null,null,null,null,"codetabel",null,null,null,null,null,{"$f":"CONCATENATE(L3,\" \",M3)","v":" "}]
[null,"breedte bouwput",{"$f":"IF(ISNUMBER(INDIRECT(A1&\"!F17\")),INDIRECT(A1&\"!F17\"))","v":false},"m",null,null,null,"eenheid","factor naar m/d",null,null,null,"grondsoort",{"$f":"CONCATENATE(L4,\" \",M4)","v":" grondsoort"},"doorlatendheid (m/dag)",null,"Bergingscoëfficiënt","Referentie"]
[null,"lengte bouwput",{"$f":"IF(ISNUMBER(INDIRECT(A1&\"!F18\")),INDIRECT(A1&\"!F18\"),\"\")","v":""},"m",null,null,null,"m/d",1]
[null,null,null,null,null,null,null,"m/s",{"$f":"3600*24","v":86400},null,null,"01","zware klei",{"$f":"CONCATENATE(L6,\" - \",M6,\" (\",O6,\" m/d)\")","v":"01 - zware klei (0,0001 m/d)"},1E-4,null,2.0000000000000001E-4,"Fm Boom, Lebbe et al. 2004-DOV"]
[null,"duur bemaling",{"$f":"INDIRECT(A1&\"!F25\")","v":0},"dagen",null,null,null,null,null,null,null,"02","potklei",{"$f":"CONCATENATE(L7,\" - \",M7,\" (\",O7,\" m/d)\")","v":"02 - potklei (0,001 m/d)"},1E-3,null,2.0000000000000001E-4,"Fm Boom, Lebbe et al. 2004-DOV"]
[null,"type sediment",{"$f":"IF(ISBLANK(INDIRECT(A1&\"!F27\")),\"\",INDIRECT(A1&\"!F27\"))","v":""},null,null,null,null,null,null,null,null,"03","matig zware klei","03 - matig zware klei (0,01 m/d)",0.01,null,0.02,"Fetter,2001-gemiddelde waarde  klei"]
[null,"K (doorlatendhied)",{"$f":"IF(ISBLANK(INDIRECT(A1&\"!F28\")),\"\",INDIRECT(A1&\"!F28\"))","v":""},{"$f":"INDIRECT(A1&\"!G28\")","v":"m/d"},"-->",{"$f":"IF(k_m_d<>\"\",k_m_d*(IF(D9=\"m/d\",1,86400)),LOOKUP(sediment_type,N6:N42,O6:O42))","v":{"$error":"#N/A"}},"m/d","keuzetabel","keuzetabel",null,null,"04","zandige klei","04 - zandige klei (0,05 m/d)",0.05,null,7.0000000000000007E-2,"Fetter,2001-gemiddelde waarde zandig klei"]
[null,"Berging",{"$f":"IF(ISBLANK(INDIRECT(A1&\"!F29\")),\"\",INDIRECT(A1&\"!F29\"))","v":""},null,null,{"$f":"IF(sy_input<>\"\",sy_input,LOOKUP(sediment_type,N6:N42,Q6:Q42))","v":{"$error":"#N/A"}},null,"mTAW",null,null,null,"05","keileem","05 - keileem (0,05 m/d)",0.05,null,0.03,"Fetter 2001, min waarde silte"]
[null,null,null,null,null,null,null,"m-mv","JA",null,null,"06","veen","06 - veen (0,01 m/d)",0.01,"0.001 - 0.1",0.2]
[null,"maaiveld",{"$f":"INDIRECT(A1&\"!O16\")","v":0},{"$f":"INDIRECT(A1&\"!P16\")","v":"mTAW"},"-->",{"$f":"0","v":0},"m-mv",null,"NEEN",null,null,"07","kleiig veen","07 - kleiig veen (0,005 m/d)",5.0000000000000001E-3,null,0.2]
[null,"Peil in rust",{"$f":"INDIRECT(A1&\"!O18\")","v":0},{"$f":"INDIRECT(A1&\"!P18\")","v":"m-mv"},"-->",{"$f":"IF(D13=\"mTAW\",maaiveld-C13,C13)","v":0},"m-mv",null,null,null,null,"08","sterk zandig veen","08 - sterk zandig veen (0,05 m/d)",0.05,null,0.2]
[null,"Onderkant bouwput",{"$f":"INDIRECT(A1&\"!F19\")","v":0},{"$f":"INDIRECT(A1&\"!G19\")","v":"m-mv"},"-->",{"$f":"IF(D14=\"mTAW\",maaiveld-C14,C14)","v":0},"m-mv",{"$f":"+F14+0.5","v":0.5},"m-mv",null,null,"09","leem/löss","09 - leem/löss (0,05 m/d)",0.05,null,0.18,"Fetter,2001-gemiddelde waarde silt"]
[null,"s (gewenste verlaging)",{"$f":"INDIRECT(A1&\"!F24\")","v":0},{"$f":"INDIRECT(A1&\"!G24\")","v":"m-mv"},"-->",{"$f":"IF(D15=\"mTAW\",maaiveld-C15,C15)","v":0},"m-mv",null,null,null,null,"10","zandige leem","10 - zandige leem (0,3 m/d)",0.3,null,0.19,"Fetter,2001-max waarde silt"]
[null,"s (gewenste verlaging)",{"$f":"F15-F13","v":0},{"$f":"IF(verlaging<=0,\"negatieve verlaging: pas peilen aan!\",\"m\")","v":"negatieve verlaging: pas peilen aan!"},null,null,null,null,null,null,null,"11","lichte zavel","11 - lichte zavel (0,5 m/d)",0.5,null,0.1,"Fetter,2001-min fijn zand"]
[null,"diepte filter",{"$f":"INDIRECT(A1&\"!F26\")","v":0},{"$f":"INDIRECT(A1&\"!G26\")","v":"m-mv"},"-->",{"$f":"IF(D17=\"mTAW\",maaiveld-C17,C17)","v":0},"m-mv",null,null,null,null,"12","uiterst fijn zand (kleiig)","12 - uiterst fijn zand (kleiig) (0,5 m/d)",0.5,null,0.1,"Fetter,2001-min fijn zand"]
[null,"ondoorlatende basis",{"$f":"INDIRECT(A1&\"!F30\")","v":0},{"$f":"INDIRECT(A1&\"!G30\")","v":"m-mv"},"-->",{"$f":"IF(D18=\"mTAW\",maaiveld-C18,C18)","v":0},"m-mv",null,null,null,null,"13","uiterst fijn zand (zwak kleiig)","13 - uiterst fijn zand (zwak kleiig) (2 m/d)",2,null,0.1,"Fetter,2001-min fijn zand"]
[null,"H (beperkt tot onderkant filter)",{"$f":"MIN(F17,F18)-F13","v":0},"dikte verzadigde zone vanaf onderkant filter in m",null,null,null,null,null,null,null,"14","uiterst fijn zand (zuiver)","14 - uiterst fijn zand (zuiver) (3 m/d)",3,null,0.1,"Fetter,2001-min fijn zand"]
[null,"Dikte Aqufier",{"$f":"Basis-F13","v":0},"m",null,null,null,null,null,null,null,"15","zeer fijn zand (kleiig)","15 - zeer fijn zand (kleiig) (1 m/d)",1,null,0.21,"Fetter,2001-gemiddelde fijn zand"]
[null,"Verlaging op afstand",0.05,null,null,null,null,null,null,null,null,"16","zeer fijn zand (zwak kleiig)","16 - zeer fijn zand (zwak kleiig) (4 m/d)",4,null,0.21,"Fetter,2001-gemiddelde fijn zand"]
[null,null,null,null,null,null,null,null,null,null,null,"17","zeer fijn zand (zuiver)","17 - zeer fijn zand (zuiver) (6 m/d)",6,null,0.21,"Fetter,2001-gemiddelde fijn zand"]
[null,"INPUT VOLLEDIG:",{"$f":"IF(OR(ISBLANK(breedte),ISBLANK(lengte),ISBLANK(duur),ISBLANK(doorlatendheid),ISBLANK(F18),ISBLANK(F13),ISBLANK(F14),ISBLANK(F15),ISBLANK(F17),ISBLANK(OpAfstand)),\"vul input aan in gele cellen\",\"OK\")","v":"OK"},null,null,null,null,null,null,null,null,"18","matig fijn zand (kleiig)","18 - matig fijn zand (kleiig) (3 m/d)",3,null,0.28000000000000003,"Fetter,2001-max fijn zand"]
[null,"INPUT CONSISTENT",{"$f":"IF(INDIRECT(A1&\"!N21\")=\"\",\"OK\",\"zie opmerkingen input tabblad\")","v":"OK"},null,null,null,null,null,null,null,null,"19","matig fijn zand (zwak kleiig)","19 - matig fijn zand (zwak kleiig) (10 m/d)",10,null,0.28000000000000003,"Fetter,2001-max fijn zand"]
[null,"VOLLEDIG EN CONSINTENT:",{"$f":"IF(AND(C23=\"OK\",C24=\"OK\"),\"OK\",\"controleer input\")","v":"OK"},null,null,null,null,null,null,null,null,"20","matig fijn zand (zuiver)","20 - matig fijn zand (zuiver) (15 m/d)",15,null,0.28000000000000003,"Fetter,2001-max fijn zand"]
[null,"OUTPUT",null,null,null,null,null,null,null,null,null,"21","matig grof zand (kleiig)","21 - matig grof zand (kleiig) (5 m/d)",5,null,0.32,"Fetter,2001-max medium zand (min en gemiddelde fijn zand zijn lager dan max fijn zand)"]
[null,"Edelman",null,null,null,null,null,null,null,null,null,"22","matig grof zand (zwak kleiig)","22 - matig grof zand (zwak kleiig) (20 m/d)",20,null,0.32,"Fetter,2001-max medium zand (min en gemiddelde fijn zand zijn lager dan max fijn zand)"]
[null,"Tijd (dagen)","Invloedstraal (m) ","Debiet (m³/d)","Invers erfc",null,null,null,null,null,null,"23","matig grof zand (zuiver)","23 - matig grof zand (zuiver) (30 m/d)",30,null,0.32,"Fetter,2001-max medium zand (min en gemiddelde fijn zand zijn lager dan max fijn zand)"]
[null,1,{"$f":"2*InvErf/(Berging/(doorlatendheid*Dikte*B29))^0.5","v":{"$error":"#DIV/0!"}},{"$f":"verlaging*SQRT((Berging*doorlatendheid*(Dikte))/(PI()*B29))*2*lengte","v":{"$error":"#N/A"}},{"$f":"-_xlfn.NORM.S.INV((OpAfstand/verlaging)/2)/SQRT(2)","v":{"$error":"#DIV/0!"}},null,null,null,null,null,null,"24","zeer grof zand (kleiig)","24 - zeer grof zand (kleiig) (10 m/d)",10,null,0.35,"Fetter,2001-max grof zand (min en gemiddelde fijn zand zijn lager dan max fijn zand)"]
[null,{"$f":"B29+duur/20","v":1},{"$error":"#DIV/0!"},{"$error":"#N/A"},null,null,null,null,null,null,null,"25","zeer grof zand (zwak kleiig)","25 - zeer grof zand (zwak kleiig) (35 m/d)",35,null,0.35,"Fetter,2001-max grof zand (min en gemiddelde fijn zand zijn lager dan max fijn zand)"]
[null,1,{"$error":"#DIV/0!"},{"$error":"#N/A"},null,null,null,null,null,null,null,"26","zeer grof zand (zuiver)","26 - zeer grof zand (zuiver) (55 m/d)",55,null,0.35,"Fetter,2001-max grof zand (min en gemiddelde fijn zand zijn lager dan max fijn zand)"]
[null,1,{"$error":"#DIV/0!"},{"$error":"#N/A"},null,null,null,null,null,null,null,"27","uiterst grof zand (kleiig)","27 - uiterst grof zand (kleiig) (50 m/d)",50,null,0.35,"Fetter,2001-max grof en grindhoudend zand (min en gemiddelde fijn zand zijn lager dan max fijn zand)"]
[null,1,{"$error":"#DIV/0!"},{"$error":"#N/A"},null,null,null,null,null,null,null,"28","uiterst grof zand (zwak kleiig)","28 - uiterst grof zand (zwak kleiig) (150 m/d)",150,null,0.35,"Fetter,2001-max grof en grindhoudend zand (min en gemiddelde fijn zand zijn lager dan max fijn zand)"]
[null,1,{"$error":"#DIV/0!"},{"$error":"#N/A"},null,null,null,null,null,null,null,"29","uiterst grof zand (zuiver)","29 - uiterst grof zand (zuiver) (250 m/d)",250,null,0.35,"Fetter,2001-max grof en grindhoudend zand (min en gemiddelde fijn zand zijn lager dan max fijn zand)"]
[null,1,{"$error":"#DIV/0!"},{"$error":"#N/A"},null,null,null,null,null,null,null,"30","teelaarde","30 - teelaarde (5 m/d)",5,null,0.2]
[null,1,{"$error":"#DIV/0!"},{"$error":"#N/A"},null,null,null,null,null,null,null,"31","schelpen","31 - schelpen (30 m/d)",30,null,0.2]
[null,1,{"$error":"#DIV/0!"},{"$error":"#N/A"},null,null,null,null,null,null,null,"32","duinzand","32 - duinzand (7 m/d)",7,null,0.2]
[null,1,{"$error":"#DIV/0!"},{"$error":"#N/A"},null,null,null,null,null,null,null,"33","grof zand","33 - grof zand (30 m/d)",30,null,0.32,"Fetter,2001-max medium zand (min en gemiddelde fijn zand zijn lager dan max fijn zand)"]
[null,1,{"$error":"#DIV/0!"},{"$error":"#N/A"},null,null,null,null,null,null,null,"34","zeer grof zand","34 - zeer grof zand (80 m/d)",80,null,0.35,"Fetter,2001-max grof en grindhoudend zand (min en gemiddelde fijn zand zijn lager dan max fijn zand)"]
[null,1,{"$error":"#DIV/0!"},{"$error":"#N/A"},null,null,null,null,null,null,null,"35","uiterst grof zand","35 - uiterst grof zand (200 m/d)",200,null,0.35,"Fetter,2001-max grof en grindhoudend zand (min en gemiddelde fijn zand zijn lager dan max fijn zand)"]
[null,1,{"$error":"#DIV/0!"},{"$error":"#N/A"},null,null,null,null,null,null,null,"36","fijn grind","36 - fijn grind (1000 m/d)",1000,null,0.25,"Fetter,2001-gemiddelde waarde fijn grind"]
[null,1,{"$error":"#DIV/0!"},{"$error":"#N/A"},null,null,null,null,null,null,null,"37","grof grind","37 - grof grind (10000 m/d)",10000,"1.000 - 10.000",0.22,"Fetter,2001-gemiddelde waarde grof grind"]
[null,1,{"$error":"#DIV/0!"},{"$error":"#N/A"},null,null,null,null,null,null,null,"38",null,null,null,"10.000 - 100.000"]
[null,1,{"$error":"#DIV/0!"},{"$error":"#N/A"}]
[null,1,{"$error":"#DIV/0!"},{"$error":"#N/A"},null,null,null,null,null,null,null,null,"Bron: Grondwaterzakboekje 2016, Bram Bot"]
[null,1,{"$error":"#DIV/0!"},{"$error":"#N/A"}]
[null,1,{"$error":"#DIV/0!"},{"$error":"#N/A"}]
[null,1,{"$error":"#DIV/0!"},{"$error":"#N/A"}]
[null,{"$f":"duur","v":0},{"$error":"#DIV/0!"},{"$f":"verlaging*SQRT((Berging*doorlatendheid*(Dikte))/(PI()*B49))*2*lengte","v":{"$error":"#N/A"}}]
[]
[null,"Bepaling initieel debiet",null,null,"Maximaal enkelvoudig debiet"]
[null,"Equivalente straal Re",{"$f":"(breedte+lengte)/PI()","v":{"$error":"#VALUE!"}},"m","Aantal filters",{"$f":"IF(ISNUMBER(INDIRECT(A1&\"!F21\")),(lengte/INDIRECT(A1&\"!F21\"))*2,(lengte/5*2))","v":{"$error":"#VALUE!"}}]
[null,"Invloedstraal Scihardt",{"$f":"3000*verlaging*SQRT(doorlatendheid/(3600*24))","v":{"$error":"#N/A"}},"m","hf",{"$f":"diepte_filter-F14","v":0}]
[null,"onvolkomen bron",{"$f":"Basis-diepte_filter","v":0},"m","Maximaal debiet per filters",{"$f":"2*PI()*0.075*F53*SQRT(doorlatendheid/(24*60*60))/15*3600","v":{"$error":"#N/A"}},"m³/u"]
[null,"Vermenigvuldigingsfactor bij onvolkomen bron",{"$f":"IF(C54<1,1,IF(C54<2,1.05,IF(C54<3,1.1,IF(C54<4,1.15,IF(C54<5,1.2,1.25)))))","v":1},null,"Totaal maximaal debiet",{"$f":"F54*F52*24","v":{"$error":"#N/A"}},"m³/d"]
[null,"Debiet volgens Sichardt (m³/dag)",{"$f":"C55*(PI()*doorlatendheid*(rustpeil^2-(rustpeil-verlaging)^2))/(LN(C53+C52)-LN(C52))","v":{"$error":"#N/A"}},"m³/dag"]
[null,"tijd (volgens edelman)","Contole debiet Edelman","Initiele invloedstraal Edelman"]
[null,{"$f":"(Berging*doorlatendheid*Dikte)/(PI()*(C56/(verlaging*2*lengte))^2)","v":{"$error":"#N/A"}},{"$f":"verlaging*SQRT((Berging*doorlatendheid*(Dikte))/(PI()*B58))*2*lengte","v":{"$error":"#N/A"}},{"$f":"2*InvErf/(Berging/(doorlatendheid*Dikte*B58))^0.5","v":{"$error":"#DIV/0!"}}]
[]
[null,"Correctie in vergelijking met modflow - emprische vergelijking"]
[null,"Tussenstap"]
[null,null,"Debiet edelman (m³/dag)","Gecorrigeerd debiet (m³/dag)","Debiet kleiner dan maximaal debiet filters"]
[null,3,{"$f":"verlaging*SQRT((Berging*doorlatendheid*(Dikte))/(PI()*B63))*2*lengte","v":{"$error":"#N/A"}},{"$f":"C63*0.95+((88.718*doorlatendheid)+180.56)","v":{"$error":"#N/A"}},{"$f":"IF(D63<F55,D63,F55)","v":{"$error":"#N/A"}}]
[null,"Finaal"]
[null,"Initiële tijdsstap (dagen)","Initieel debiet (m³/dag)","Initiële invloedsstraal (m)"]
[null,{"$f":"(Berging*doorlatendheid*Dikte)/(PI()*(E63/(verlaging*2*lengte))^2)","v":{"$error":"#N/A"}},{"$f":"E63","v":{"$error":"#N/A"}},{"$f":"2*InvErf/(Berging/(doorlatendheid*Dikte*B66))^0.5","v":{"$error":"#DIV/0!"}}]
[]
[null,"Correctie \"stationair\" debiet"]
[null,"Stationaire tijddstap (dagen)","Debiet edelman (m³/dag)","Gecorrigeerd debiet (m³/dag)","Debiet kleiner dan maximaal debiet filters"]
[null,7,{"$f":"verlaging*SQRT((Berging*doorlatendheid*(Dikte))/(PI()*B70))*2*lengte","v":{"$error":"#N/A"}},{"$f":"C70*0.6+((80.61*doorlatendheid)+91.14)","v":{"$error":"#N/A"}},{"$f":"IF(D70<F55,D70,F55)","v":{"$error":"#N/A"}}]
[null,"Controle berekenin aangepaste Dupuit"]
[null,"Tijd (dagen)","Debiet laterale stroming (m³/dag)","Re","Debiet radiale stroming (m³/dag)","Totaal debiet (m³/d)","Controle"]
[null,{"$f":"B29","v":1},{"$f":"((doorlatendheid*(($F$13-Basis)^2-($F$15-Basis)^2))/(C29-breedte/2))*(lengte-breedte)","v":{"$error":"#N/A"}},{"$f":"(2*breedte)/PI()","v":0},{"$f":"(PI()*doorlatendheid*(($F$13-Basis)^2-($F$15-Basis)^2 ))/LN(C29/Re)","v":{"$error":"#N/A"}},{"$f":"C73+E73","v":{"$error":"#N/A"}},{"$f":"IF(q_sichard<E73,1,0)","v":{"$error":"#N/A"}}]
[null,1,{"$error":"#N/A"},null,{"$error":"#N/A"},{"$f":"C74+E74","v":{"$error":"#N/A"}}]
[null,1,{"$error":"#N/A"},null,{"$error":"#N/A"},{"$error":"#N/A"}]
[null,1,{"$error":"#N/A"},null,{"$error":"#N/A"},{"$error":"#N/A"}]
[null,1,{"$error":"#N/A"},null,{"$error":"#N/A"},{"$error":"#N/A"}]
[null,1,{"$error":"#N/A"},null,{"$error":"#N/A"},{"$error":"#N/A"}]
[null,1,{"$error":"#N/A"},null,{"$error":"#N/A"},{"$error":"#N/A"}]
[null,1,{"$error":"#N/A"},null,{"$error":"#N/A"},{"$error":"#N/A"}]
[null,1,{"$error":"#N/A"},null,{"$error":"#N/A"},{"$error":"#N/A"}]
[null,1,{"$error":"#N/A"},null,{"$error":"#N/A"},{"$error":"#N/A"}]
[null,1,{"$error":"#N/A"},null,{"$error":"#N/A"},{"$f":"C83+E83","v":{"$error":"#N/A"}}]
[null,1,{"$error":"#N/A"},null,{"$error":"#N/A"},{"$error":"#N/A"}]
[null,1,{"$error":"#N/A"},null,{"$error":"#N/A"},{"$error":"#N/A"}]
[null,1,{"$error":"#N/A"},null,{"$error":"#N/A"},{"$error":"#N/A"}]
[null,1,{"$error":"#N/A"},null,{"$error":"#N/A"},{"$error":"#N/A"}]
[null,1,{"$error":"#N/A"},null,{"$error":"#N/A"},{"$error":"#N/A"}]
[null,1,{"$error":"#N/A"},null,{"$error":"#N/A"},{"$error":"#N/A"}]
[null,1,{"$error":"#N/A"},null,{"$error":"#N/A"},{"$error":"#N/A"}]
[null,1,{"$error":"#N/A"},null,{"$error":"#N/A"},{"$error":"#N/A"}]
[null,1,{"$error":"#N/A"},null,{"$error":"#N/A"},{"$error":"#N/A"}]
[null,0,{"$error":"#N/A"},null,{"$error":"#N/A"},{"$f":"C93+E93","v":{"$error":"#N/A"}}]
[]
[]
[]
[]
[null,"Verlaging op afstand"]
[null,"Input",null,null,"Berekening"]
[null,"Tijd (dagen)",{"$f":"INDIRECT(A1&\"!C54\")","v":0},null,"u",{"$f":"0.5*afstand_r*SQRT(Berging/(doorlatendheid*Dikte*Tijd_s_afst))","v":{"$error":"#N/A"}}]
[null,"Afstand (m)",{"$f":"INDIRECT(A1&\"!D54\")","v":0},null,"verlaging s (m)",{"$f":"verlaging*ERFC(u)","v":{"$error":"#N/A"}}]
[null,null,null,null,"verlaging s (mTAW)",{"$f":"(maaiveld-F13)-F101","v":{"$error":"#N/A"}}]
[null,null,null,null,"verlaging s (m-mv)",{"$f":"$F$13+$F$101","v":{"$error":"#N/A"}}]
[null,null,null,null,"Verzadigde dikte H (in m)",{"$f":"-F103+F17","v":{"$error":"#N/A"}}]
[]
[]
[]
[null,"Transport berekening"]
[null,"Verplaatsing als duur en afstand gegeven is",null,null,"Berekening"]
[null,"Effectieve porositeit",{"$f":"INDIRECT(A1&\"!K24\")","v":0},null,"Gradient",{"$f":"F101","v":{"$error":"#N/A"}}]
[null,"Retardatiefactor",{"$f":"INDIRECT(A1&\"!K25\")","v":0},null,"Stroomsnelheid (m/d)",{"$f":"IF(ISBLANK(EffecPor),\"\",F110*doorlatendheid/EffecPor)","v":{"$error":"#N/A"}}]
[null,null,null,null,"Verspreidingssnelheid (m/d)",{"$f":"IF(ISBLANK(Rd),\"\",vs/Rd)","v":{"$error":"#N/A"}}]
[null,null,null,null,"Totale verplaatsing (m)",{"$f":"vv*Tijd_s_afst","v":{"$error":"#N/A"}}]
[]
[null,null,null,null,"Dagen tot bouwput",{"$f":"INDIRECT(A1&\"!E54\")/vv","v":{"$error":"#N/A"}}]
[null,"Duur tot de verontreiniging de bouwput bereikt"]

{"sheet":"Transportberekening","index":4,"n_rows":502,"n_cols":11,"rows_kept":502,"cut":false,"hidden":false,"merged":[]}
["INPUT_OUTPUT","Berekening"]
["INPUT"]
[null,"Verontreiniging op (m rand)",{"$f":"INDIRECT(A1&\"!k23\")","v":0},null,null,"Effectieve porositeit",{"$f":"INDIRECT(B1&\"!C110\")","v":0},"Retardatiefactor",{"$f":"INDIRECT(B1&\"!C111\")","v":0}]
[]
[]
[null,null,null,null,null,null,null,null,"Sleuf bereikt na",{"$f":"IF(MAX(B9:B499)<INDIRECT(A1&\"!F25\"),MAX(B9:B499),\"\")","v":""},"dagen"]
["Berekening gradiënt volgens edelman",null,null,null,null,null,null,null,"Verplaatsing indien bouwput niet bereikt werd",{"$f":"IF(NOT(ISNUMBER($J$6)),$C$3 -LOOKUP(ROUND(INDIRECT($B$1&\"!C7\"),1),B9:B502,H9:H502))","v":{"$error":"#N/A"}},"m"]
[null,"tijd (dag)","afstand (m)","verlaging (m)","gradiënt (m/m)","snelheid (m/d) conservatief","verplaatsing op deze dag met retardatie","Nieuwe positie"]
[null,0.01,{"$f":"IF(ISNUMBER(B9),C3,\"\")","v":0},{"$f":"IF(AND(B9<INDIRECT($B$1&\"!$C$7\"),ISNUMBER(B9)),INDIRECT($B$1&\"!$C$16\")*ERFC(0.5*C9*SQRT(INDIRECT($B$1&\"!$F$10\")/(INDIRECT($B$1&\"!$F$9\")*INDIRECT($B$1&\"!$C$20\")*B9))),\"\")","v":""},{"$f":"(INDIRECT($B$1&\"!$F$15\") -D9)/C9","v":{"$error":"#VALUE!"}},{"$f":"IF(ISNUMBER(E9),E9*INDIRECT($B$1&\"!$F$9\")/$G$3,\"\")","v":""},{"$f":"IF(ISNUMBER(F9),F9*B9/$I$3,\"\")","v":""},{"$f":"IF(B9<INDIRECT($B$1&\"!$C$7\"),C9-G9,\"\")","v":""}]
[null,{"$f":"IF(ISNUMBER(B9),IF(AND(B9<INDIRECT($B$1&\"!$C$7\"),H9>0), B9+0.5,\"\"),\"\")","v":""},{"$f":"IF(ISNUMBER(B10),H9,\"\")","v":""},{"$f":"IF(AND(B10<INDIRECT($B$1&\"!$C$7\"),ISNUMBER(B10)),INDIRECT($B$1&\"!$C$16\")*ERFC(0.5*C10*SQRT(INDIRECT($B$1&\"!$F$10\")/(INDIRECT($B$1&\"!$F$9\")*INDIRECT($B$1&\"!$C$20\")*B10))),\"\")","v":""},{"$f":"(INDIRECT($B$1&\"!$F$15\") -D10)/C10","v":{"$error":"#VALUE!"}},{"$f":"IF(ISNUMBER(E10),E10*INDIRECT($B$1&\"!$F$9\")/$G$3,\"\")","v":""},{"$f":"IF(ISNUMBER(F10),F10*ABS(B9-B10)/$I$3,\"\")","v":""},{"$f":"IF(B10<INDIRECT($B$1&\"!$C$7\"),H9-G10,\"\")","v":""}]
[null,{"$f":"IF(ISNUMBER(B10),IF(AND(B10<INDIRECT($B$1&\"!$C$7\"),H10>0), B10+0.5,\"\"),\"\")","v":""},{"$f":"IF(ISNUMBER(B11),H10,\"\")","v":""},{"$f":"IF(AND(B11<INDIRECT($B$1&\"!$C$7\"),ISNUMBER(B11)),INDIRECT($B$1&\"!$C$16\")*ERFC(0.5*C11*SQRT(INDIRECT($B$1&\"!$F$10\")/(INDIRECT($B$1&\"!$F$9\")*INDIRECT($B$1&\"!$C$20\")*B11))),\"\")","v":""},{"$f":"(INDIRECT($B$1&\"!$F$15\") -D11)/C11","v":{"$error":"#VALUE!"}},{"$f":"IF(ISNUMBER(E11),E11*INDIRECT($B$1&\"!$F$9\")/$G$3,\"\")","v":""},{"$f":"IF(ISNUMBER(F11),F11*ABS(B10-B11)/$I$3,\"\")","v":""},{"$f":"IF(B11<INDIRECT($B$1&\"!$C$7\"),H10-G11,\"\")","v":""}]
[null,{"$f":"IF(ISNUMBER(B11),IF(AND(B11<INDIRECT($B$1&\"!$C$7\"),H11>0), B11+0.5,\"\"),\"\")","v":""},"",{"$f":"IF(AND(B12<INDIRECT($B$1&\"!$C$7\"),ISNUMBER(B12)),INDIRECT($B$1&\"!$C$16\")*ERFC(0.5*C12*SQRT(INDIRECT($B$1&\"!$F$10\")/(INDIRECT($B$1&\"!$F$9\")*INDIRECT($B$1&\"!$C$20\")*B12))),\"\")","v":""},{"$f":"(INDIRECT($B$1&\"!$F$15\") -D12)/C12","v":{"$error":"#VALUE!"}},{"$f":"IF(ISNUMBER(E12),E12*INDIRECT($B$1&\"!$F$9\")/$G$3,\"\")","v":""},"",{"$f":"IF(B12<INDIRECT($B$1&\"!$C$7\"),H11-G12,\"\")","v":""}]
[null,{"$f":"IF(ISNUMBER(B12),IF(AND(B12<INDIRECT($B$1&\"!$C$7\"),H12>0), B12+0.5,\"\"),\"\")","v":""},"",{"$f":"IF(AND(B13<INDIRECT($B$1&\"!$C$7\"),ISNUMBER(B13)),INDIRECT($B$1&\"!$C$16\")*ERFC(0.5*C13*SQRT(INDIRECT($B$1&\"!$F$10\")/(INDIRECT($B$1&\"!$F$9\")*INDIRECT($B$1&\"!$C$20\")*B13))),\"\")","v":""},{"$f":"(INDIRECT($B$1&\"!$F$15\") -D13)/C13","v":{"$error":"#VALUE!"}},{"$f":"IF(ISNUMBER(E13),E13*INDIRECT($B$1&\"!$F$9\")/$G$3,\"\")","v":""},"",{"$f":"IF(B13<INDIRECT($B$1&\"!$C$7\"),H12-G13,\"\")","v":""}]
[null,{"$f":"IF(ISNUMBER(B13),IF(AND(B13<INDIRECT($B$1&\"!$C$7\"),H13>0), B13+0.5,\"\"),\"\")","v":""},"",{"$f":"IF(AND(B14<INDIRECT($B$1&\"!$C$7\"),ISNUMBER(B14)),INDIRECT($B$1&\"!$C$16\")*ERFC(0.5*C14*SQRT(INDIRECT($B$1&\"!$F$10\")/(INDIRECT($B$1&\"!$F$9\")*INDIRECT($B$1&\"!$C$20\")*B14))),\"\")","v":""},{"$f":"(INDIRECT($B$1&\"!$F$15\") -D14)/C14","v":{"$error":"#VALUE!"}},{"$f":"IF(ISNUMBER(E14),E14*INDIRECT($B$1&\"!$F$9\")/$G$3,\"\")","v":""},"",{"$f":"IF(B14<INDIRECT($B$1&\"!$C$7\"),H13-G14,\"\")","v":""}]
[null,{"$f":"IF(ISNUMBER(B14),IF(AND(B14<INDIRECT($B$1&\"!$C$7\"),H14>0), B14+0.5,\"\"),\"\")","v":""},"",{"$f":"IF(AND(B15<INDIRECT($B$1&\"!$C$7\"),ISNUMBER(B15)),INDIRECT($B$1&\"!$C$16\")*ERFC(0.5*C15*SQRT(INDIRECT($B$1&\"!$F$10\")/(INDIRECT($B$1&\"!$F$9\")*INDIRECT($B$1&\"!$C$20\")*B15))),\"\")","v":""},{"$f":"(INDIRECT($B$1&\"!$F$15\") -D15)/C15","v":{"$error":"#VALUE!"}},{"$f":"IF(ISNUMBER(E15),E15*INDIRECT($B$1&\"!$F$9\")/$G$3,\"\")","v":""},"",{"$f":"IF(B15<INDIRECT($B$1&\"!$C$7\"),H14-G15,\"\")","v":""}]
[null,{"$f":"IF(ISNUMBER(B15),IF(AND(B15<INDIRECT($B$1&\"!$C$7\"),H15>0), B15+0.5,\"\"),\"\")","v":""},"",{"$f":"IF(AND(B16<INDIRECT($B$1&\"!$C$7\"),ISNUMBER(B16)),INDIRECT($B$1&\"!$C$16\")*ERFC(0.5*C16*SQRT(INDIRECT($B$1&\"!$F$10\")/(INDIRECT($B$1&\"!$F$9\")*INDIRECT($B$1&\"!$C$20\")*B16))),\"\")","v":""},{"$f":"(INDIRECT($B$1&\"!$F$15\") -D16)/C16","v":{"$error":"#VALUE!"}},{"$f":"IF(ISNUMBER(E16),E16*INDIRECT($B$1&\"!$F$9\")/$G$3,\"\")","v":""},"",{"$f":"IF(B16<INDIRECT($B$1&\"!$C$7\"),H15-G16,\"\")","v":""}]
[null,{"$f":"IF(ISNUMBER(B16),IF(AND(B16<INDIRECT($B$1&\"!$C$7\"),H16>0), B16+0.5,\"\"),\"\")","v":""},"",{"$f":"IF(AND(B17<INDIRECT($B$1&\"!$C$7\"),ISNUMBER(B17)),INDIRECT($B$1&\"!$C$16\")*ERFC(0.5*C17*SQRT(INDIRECT($B$1&\"!$F$10\")/(INDIRECT($B$1&\"!$F$9\")*INDIRECT($B$1&\"!$C$20\")*B17))),\"\")","v":""},{"$f":"(INDIRECT($B$1&\"!$F$15\") -D17)/C17","v":{"$error":"#VALUE!"}},{"$f":"IF(ISNUMBER(E17),E17*INDIRECT($B$1&\"!$F$9\")/$G$3,\"\")","v":""},"",{"$f":"IF(B17<INDIRECT($B$1&\"!$C$7\"),H16-G17,\"\")","v":""}]
[null,{"$f":"IF(ISNUMBER(B17),IF(AND(B17<INDIRECT($B$1&\"!$C$7\"),H17>0), B17+0.5,\"\"),\"\")","v":""},"",{"$f":"IF(AND(B18<INDIRECT($B$1&\"!$C$7\"),ISNUMBER(B18)),INDIRECT($B$1&\"!$C$16\")*ERFC(0.5*C18*SQRT(INDIRECT($B$1&\"!$F$10\")/(INDIRECT($B$1&\"!$F$9\")*INDIRECT($B$1&\"!$C$20\")*B18))),\"\")","v":""},{"$f":"(INDIRECT($B$1&\"!$F$15\") -D18)/C18","v":{"$error":"#VALUE!"}},{"$f":"IF(ISNUMBER(E18),E18*INDIRECT($B$1&\"!$F$9\")/$G$3,\"\")","v":""},"",{"$f":"IF(B18<INDIRECT($B$1&\"!$C$7\"),H17-G18,\"\")","v":""}]
[null,{"$f":"IF(ISNUMBER(B18),IF(AND(B18<INDIRECT($B$1&\"!$C$7\"),H18>0), B18+0.5,\"\"),\"\")","v":""},"",{"$f":"IF(AND(B19<INDIRECT($B$1&\"!$C$7\"),ISNUMBER(B19)),INDIRECT($B$1&\"!$C$16\")*ERFC(0.5*C19*SQRT(INDIRECT($B$1&\"!$F$10\")/(INDIRECT($B$1&\"!$F$9\")*INDIRECT($B$1&\"!$C$20\")*B19))),\"\")","v":""},{"$f":"(INDIRECT($B$1&\"!$F$15\") -D19)/C19","v":{"$error":"#VALUE!"}},{"$f":"IF(ISNUMBER(E19),E19*INDIRECT($B$1&\"!$F$9\")/$G$3,\"\")","v":""},"",{"$f":"IF(B19<INDIRECT($B$1&\"!$C$7\"),H18-G19,\"\")","v":""}]
[null,{"$f":"IF(ISNUMBER(B19),IF(AND(B19<INDIRECT($B$1&\"!$C$7\"),H19>0), B19+0.5,\"\"),\"\")","v":""},"",{"$f":"IF(AND(B20<INDIRECT($B$1&\"!$C$7\"),ISNUMBER(B20)),INDIRECT($B$1&\"!$C$16\")*ERFC(0.5*C20*SQRT(INDIRECT($B$1&\"!$F$10\")/(INDIRECT($B$1&\"!$F$9\")*INDIRECT($B$1&\"!$C$20\")*B20))),\"\")","v":""},{"$f":"(INDIRECT($B$1&\"!$F$15\") -D20)/C20","v":{"$error":"#VALUE!"}},{"$f":"IF(ISNUMBER(E20),E20*INDIRECT($B$1&\"!$F$9\")/$G$3,\"\")","v":""},"",{"$f":"IF(B20<INDIRECT($B$1&\"!$C$7\"),H19-G20,\"\")","v":""}]
[null,{"$f":"IF(ISNUMBER(B20),IF(AND(B20<INDIRECT($B$1&\"!$C$7\"),H20>0), B20+0.5,\"\"),\"\")","v":""},"",{"$f":"IF(AND(B21<INDIRECT($B$1&\"!$C$7\"),ISNUMBER(B21)),INDIRECT($B$1&\"!$C$16\")*ERFC(0.5*C21*SQRT(INDIRECT($B$1&\"!$F$10\")/(INDIRECT($B$1&\"!$F$9\")*INDIRECT($B$1&\"!$C$20\")*B21))),\"\")","v":""},{"$f":"(INDIRECT($B$1&\"!$F$15\") -D21)/C21","v":{"$error":"#VALUE!"}},{"$f":"IF(ISNUMBER(E21),E21*INDIRECT($B$1&\"!$F$9\")/$G$3,\"\")","v":""},"",{"$f":"IF(B21<INDIRECT($B$1&\"!$C$7\"),H20-G21,\"\")","v":""}]
[null,{"$f":"IF(ISNUMBER(B21),IF(AND(B21<INDIRECT($B$1&\"!$C$7\"),H21>0), B21+0.5,\"\"),\"\")","v":""},"",{"$f":"IF(AND(B22<INDIRECT($B$1&\"!$C$7\"),ISNUMBER(B22)),INDIRECT($B$1&\"!$C$16\")*ERFC(0.5*C22*SQRT(INDIRECT($B$1&\"!$F$10\")/(INDIRECT($B$1&\"!$F$9\")*INDIRECT($B$1&\"!$C$20\")*B22))),\"\")","v":""},{"$f":"(INDIRECT($B$1&\"!$F$15\") -D22)/C22","v":{"$error":"#VALUE!"}},{"$f":"IF(ISNUMBER(E22),E22*INDIRECT($B$1&\"!$F$9\")/$G$3,\"\")","v":""},"",{"$f":"IF(B22<INDIRECT($B$1&\"!$C$7\"),H21-G22,\"\")","v":""}]
[null,{"$f":"IF(ISNUMBER(B22),IF(AND(B22<INDIRECT($B$1&\"!$C$7\"),H22>0), B22+0.5,\"\"),\"\")","v":""},"",{"$f":"IF(AND(B23<INDIRECT($B$1&\"!$C$7\"),ISNUMBER(B23)),INDIRECT($B$1&\"!$C$16\")*ERFC(0.5*C23*SQRT(INDIRECT($B$1&\"!$F$10\")/(INDIRECT($B$1&\"!$F$9\")*INDIRECT($B$1&\"!$C$20\")*B23))),\"\")","v":""},{"$f":"(INDIRECT($B$1&\"!$F$15\") -D23)/C23","v":{"$error":"#VALUE!"}},{"$f":"IF(ISNUMBER(E23),E23*INDIRECT($B$1&\"!$F$9\")/$G$3,\"\")","v":""},"",{"$f":"IF(B23<INDIRECT($B$1&\"!$C$7\"),H22-G23,\"\")","v":""}]
[null,{"$f":"IF(ISNUMBER(B23),IF(AND(B23<INDIRECT($B$1&\"!$C$7\"),H23>0), B23+0.5,\"\"),\"\")","v":""},"",{"$f":"IF(AND(B24<INDIRECT($B$1&\"!$C$7\"),ISNUMBER(B24)),INDIRECT($B$1&\"!$C$16\")*ERFC(0.5*C24*SQRT(INDIRECT($B$1&\"!$F$10\")/(INDIRECT($B$1&\"!$F$9\")*INDIRECT($B$1&\"!$C$20\")*B24))),\"\")","v":""},{"$f":"(INDIRECT($B$1&\"!$F$15\") -D24)/C24","v":{"$error":"#VALUE!"}},{"$f":"IF(ISNUMBER(E24),E24*INDIRECT($B$1&\"!$F$9\")/$G$3,\"\")","v":""},"",{"$f":"IF(B24<INDIRECT($B$1&\"!$C$7\"),H23-G24,\"\")","v":""}]
[null,{"$f":"IF(ISNUMBER(B24),IF(AND(B24<INDIRECT($B$1&\"!$C$7\"),H24>0), B24+0.5,\"\"),\"\")","v":""},"",{"$f":"IF(AND(B25<INDIRECT($B$1&\"!$C$7\"),ISNUMBER(B25)),INDIRECT($B$1&\"!$C$16\")*ERFC(0.5*C25*SQRT(INDIRECT($B$1&\"!$F$10\")/(INDIRECT($B$1&\"!$F$9\")*INDIRECT($B$1&\"!$C$20\")*B25))),\"\")","v":""},{"$f":"(INDIRECT($B$1&\"!$F$15\") -D25)/C25","v":{"$error":"#VALUE!"}},{"$f":"IF(ISNUMBER(E25),E25*INDIRECT($B$1&\"!$F$9\")/$G$3,\"\")","v":""},"",{"$f":"IF(B25<INDIRECT($B$1&\"!$C$7\"),H24-G25,\"\")","v":""}]
[null,{"$f":"IF(ISNUMBER(B25),IF(AND(B25<INDIRECT($B$1&\"!$C$7\"),H25>0), B25+0.5,\"\"),\"\")","v":""},"",{"$f":"IF(AND(B26<INDIRECT($B$1&\"!$C$7\"),ISNUMBER(B26)),INDIRECT($B$1&\"!$C$16\")*ERFC(0.5*C26*SQRT(INDIRECT($B$1&\"!$F$10\")/(INDIRECT($B$1&\"!$F$9\")*INDIRECT($B$1&\"!$C$20\")*B26))),\"\")","v":""},{"$f":"(INDIRECT($B$1&\"!$F$15\") -D26)/C26","v":{"$error":"#VALUE!"}},{"$f":"IF(ISNUMBER(E26),E26*INDIRECT($B$1&\"!$F$9\")/$G$3,\"\")","v":""},"",{"$f":"IF(B26<INDIRECT($B$1&\"!$C$7\"),H25-G26,\"\")","v":""}]
[null,{"$f":"IF(ISNUMBER(B26),IF(AND(B26<INDIRECT($B$1&\"!$C$7\"),H26>0), B26+0.5,\"\"),\"\")","v":""},{"$f":"IF(ISNUMBER(B27),H26,\"\")","v":""},{"$f":"IF(AND(B27<INDIRECT($B$1&\"!$C$7\"),ISNUMBER(B27)),INDIRECT($B$1&\"!$C$16\")*ERFC(0.5*C27*SQRT(INDIRECT($B$1&\"!$F$10\")/(INDIRECT($B$1&\"!$F$9\")*INDIRECT($B$1&\"!$C$20\")*B27))),\"\")","v":""},{"$f":"(INDIRECT($B$1&\"!$F$15\") -D27)/C27","v":{"$error":"#VALUE!"}},{"$f":"IF(ISNUMBER(E27),E27*INDIRECT($B$1&\"!$F$9\")/$G$3,\"\")","v":""},"",{"$f":"IF(B27<INDIRECT($B$1&\"!$C$7\"),H26-G27,\"\")","v":""}]
[null,{"$f":"IF(ISNUMBER(B27),IF(AND(B27<INDIRECT($B$1&\"!$C$7\"),H27>0), B27+0.5,\"\"),\"\")","v":""},"",{"$f":"IF(AND(B28<INDIRECT($B$1&\"!$C$7\"),ISNUMBER(B28)),INDIRECT($B$1&\"!$C$16\")*ERFC(0.5*C28*SQRT(INDIRECT($B$1&\"!$F$10\")/(INDIRECT($B$1&\"!$F$9\")*INDIRECT($B$1&\"!$C$20\")*B28))),\"\")","v":""},{"$f":"(INDIRECT($B$1&\"!$F$15\") -D28)/C28","v":{"$error":"#VALUE!"}},{"$f":"IF(ISNUMBER(E28),E28*INDIRECT($B$1&\"!$F$9\")/$G$3,\"\")","v":""},"",{"$f":"IF(B28<INDIRECT($B$1&\"!$C$7\"),H27-G28,\"\")","v":""}]
[null,{"$f":"IF(ISNUMBER(B28),IF(AND(B28<INDIRECT($B$1&\"!$C$7\"),H28>0), B28+0.5,\"\"),\"\")","v":""},"",{"$f":"IF(AND(B29<INDIRECT($B$1&\"!$C$7\"),ISNUMBER(B29)),INDIRECT($B$1&\"!$C$16\")*ERFC(0.5*C29*SQRT(INDIRECT($B$1&\"!$F$10\")/(INDIRECT($B$1&\"!$F$9\")*INDIRECT($B$1&\"!$C$20\")*B29))),\"\")","v":""},{"$f":"(INDIRECT($B$1&\"!$F$15\") -D29)/C29","v":{"$error":"#VALUE!"}},{"$f":"IF(ISNUMBER(E29),E29*INDIRECT($B$1&\"!$F$9\")/$G$3,\"\")","v":""},"",{"$f":"IF(B29<INDIRECT($B$1&\"!$C$7\"),H28-G29,\"\")","v":""}]
[null,{"$f":"IF(ISNUMBER(B29),IF(AND(B29<INDIRECT($B$1&\"!$C$7\"),H29>0), B29+0.5,\"\"),\"\")","v":""},"",{"$f":"IF(AND(B30<INDIRECT($B$1&\"!$C$7\"),ISNUMBER(B30)),INDIRECT($B$1&\"!$C$16\")*ERFC(0.5*C30*SQRT(INDIRECT($B$1&\"!$F$10\")/(INDIRECT($B$1&\"!$F$9\")*INDIRECT($B$1&\"!$C$20\")*B30))),\"\")","v":""},{"$f":"(INDIRECT($B$1&\"!$F$15\") -D30)/C30","v":{"$error":"#VALUE!"}},{"$f":"IF(ISNUMBER(E30),E30*INDIRECT($B$1&\"!$F$9\")/$G$3,\"\")","v":""},"",{"$f":"IF(B30<INDIRECT($B$1&\"!$C$7\"),H29-G30,\"\")","v":""}]
[null,{"$f":"IF(ISNUMBER(B30),IF(AND(B30<INDIRECT($B$1&\"!$C$7\"),H30>0), B30+0.5,\"\"),\"\")","v":""},"",{"$f":"IF(AND(B31<INDIRECT($B$1&\"!$C$7\"),ISNUMBER(B31)),INDIRECT($B$1&\"!$C$16\")*ERFC(0.5*C31*SQRT(INDIRECT($B$1&\"!$F$10\")/(INDIRECT($B$1&\"!$F$9\")*INDIRECT($B$1&\"!$C$20\")*B31))),\"\")","v":""},{"$f":"(INDIRECT($B$1&\"!$F$15\") -D31)/C31","v":{"$error":"#VALUE!"}},{"$f":"IF(ISNUMBER(E31),E31*INDIRECT($B$1&\"!$F$9\")/$G$3,\"\")","v":""},"",{"$f":"IF(B31<INDIRECT($B$1&\"!$C$7\"),H30-G31,\"\")","v":""}]
[null,{"$f":"IF(ISNUMBER(B31),IF(AND(B31<INDIRECT($B$1&\"!$C$7\"),H31>0), B31+0.5,\"\"),\"\")","v":""},"",{"$f":"IF(AND(B32<INDIRECT($B$1&\"!$C$7\"),ISNUMBER(B32)),INDIRECT($B$1&\"!$C$16\")*ERFC(0.5*C32*SQRT(INDIRECT($B$1&\"!$F$10\")/(INDIRECT($B$1&\"!$F$9\")*INDIRECT($B$1&\"!$C$20\")*B32))),\"\")","v":""},{"$f":"(INDIRECT($B$1&\"!$F$15\") -D32)/C32","v":{"$error":"#VALUE!"}},{"$f":"IF(ISNUMBER(E32),E32*INDIRECT($B$1&\"!$F$9\")/$G$3,\"\")","v":""},"",{"$f":"IF(B32<INDIRECT($B$1&\"!$C$7\"),H31-G32,\"\")","v":""}]
[null,{"$f":"IF(ISNUMBER(B32),IF(AND(B32<INDIRECT($B$1&\"!$C$7\"),H32>0), B32+0.5,\"\"),\"\")","v":""},"",{"$f":"IF(AND(B33<INDIRECT($B$1&\"!$C$7\"),ISNUMBER(B33)),INDIRECT($B$1&\"!$C$16\")*ERFC(0.5*C33*SQRT(INDIRECT($B$1&\"!$F$10\")/(INDIRECT($B$1&\"!$F$9\")*INDIRECT($B$1&\"!$C$20\")*B33))),\"\")","v":""},{"$f":"(INDIRECT($B$1&\"!$F$15\") -D33)/C33","v":{"$error":"#VALUE!"}},{"$f":"IF(ISNUMBER(E33),E33*INDIRECT($B$1&\"!$F$9\")/$G$3,\"\")","v":""},"",{"$f":"IF(B33<INDIRECT($B$1&\"!$C$7\"),H32-G33,\"\")","v":""}]
[null,{"$f":"IF(ISNUMBER(B33),IF(AND(B33<INDIRECT($B$1&\"!$C$7\"),H33>0), B33+0.5,\"\"),\"\")","v":""},"",{"$f":"IF(AND(B34<INDIRECT($B$1&\"!$C$7\"),ISNUMBER(B34)),INDIRECT($B$1&\"!$C$16\")*ERFC(0.5*C34*SQRT(INDIRECT($B$1&\"!$F$10\")/(INDIRECT($B$1&\"!$F$9\")*INDIRECT($B$1&\"!$C$20\")*B34))),\"\")","v":""},{"$f":"(INDIRECT($B$1&\"!$F$15\") -D34)/C34","v":{"$error":"#VALUE!"}},{"$f":"IF(ISNUMBER(E34),E34*INDIRECT($B$1&\"!$F$9\")/$G$3,\"\")","v":""},"",{"$f":"IF(B34<INDIRECT($B$1&\"!$C$7\"),H33-G34,\"\")","v":""}]
[null,{"$f":"IF(ISNUMBER(B34),IF(AND(B34<INDIRECT($B$1&\"!$C$7\"),H34>0), B34+0.5,\"\"),\"\")","v":""},"",{"$f":"IF(AND(B35<INDIRECT($B$1&\"!$C$7\"),ISNUMBER(B35)),INDIRECT($B$1&\"!$C$16\")*ERFC(0.5*C35*SQRT(INDIRECT($B$1&\"!$F$10\")/(INDIRECT($B$1&\"!$F$9\")*INDIRECT($B$1&\"!$C$20\")*B35))),\"\")","v":""},{"$f":"(INDIRECT($B$1&\"!$F$15\") -D35)/C35","v":{"$error":"#VALUE!"}},{"$f":"IF(ISNUMBER(E35),E35*INDIRECT($B$1&\"!$F$9\")/$G$3,\"\")","v":""},"",{"$f":"IF(B35<INDIRECT($B$1&\"!$C$7\"),H34-G35,\"\")","v":""}]
[null,{"$f":"IF(ISNUMBER(B35),IF(AND(B35<INDIRECT($B$1&\"!$C$7\"),H35>0), B35+0.5,\"\"),\"\")","v":""},"",{"$f":"IF(AND(B36<INDIRECT($B$1&\"!$C$7\"),ISNUMBER(B36)),INDIRECT($B$1&\"!$C$16\")*ERFC(0.5*C36*SQRT(INDIRECT($B$1&\"!$F$10\")/(INDIRECT($B$1&\"!$F$9\")*INDIRECT($B$1&\"!$C$20\")*B36))),\"\")","v":""},{"$f":"(INDIRECT($B$1&\"!$F$15\") -D36)/C36","v":{"$error":"#VALUE!"}},{"$f":"IF(ISNUMBER(E36),E36*INDIRECT($B$1&\"!$F$9\")/$G$3,\"\")","v":""},"",{"$f":"IF(B36<INDIRECT($B$1&\"!$C$7\"),H35-G36,\"\")","v":""}]
[null,{"$f":"IF(ISNUMBER(B36),IF(AND(B36<INDIRECT($B$1&\"!$C$7\"),H36>0), B36+0.5,\"\"),\"\")","v":""},"",{"$f":"IF(AND(B37<INDIRECT($B$1&\"!$C$7\"),ISNUMBER(B37)),INDIRECT($B$1&\"!$C$16\")*ERFC(0.5*C37*SQRT(INDIRECT($B$1&\"!$F$10\")/(INDIRECT($B$1&\"!$F$9\")*INDIRECT($B$1&\"!$C$20\")*B37))),\"\")","v":""},{"$f":"(INDIRECT($B$1&\"!$F$15\") -D37)/C37","v":{"$error":"#VALUE!"}},{"$f":"IF(ISNUMBER(E37),E37*INDIRECT($B$1&\"!$F$9\")/$G$3,\"\")","v":""},"",{"$f":"IF(B37<INDIRECT($B$1&\"!$C$7\"),H36-G37,\"\")","v":""}]
[null,{"$f":"IF(ISNUMBER(B37),IF(AND(B37<INDIRECT($B$1&\"!$C$7\"),H37>0), B37+0.5,\"\"),\"\")","v":""},"",{"$f":"IF(AND(B38<INDIRECT($B$1&\"!$C$7\"),ISNUMBER(B38)),INDIRECT($B$1&\"!$C$16\")*ERFC(0.5*C38*SQRT(INDIRECT($B$1&\"!$F$10\")/(INDIRECT($B$1&\"!$F$9\")*INDIRECT($B$1&\"!$C$20\")*B38))),\"\")","v":""},{"$f":"(INDIRECT($B$1&\"!$F$15\") -D38)/C38","v":{"$error":"#VALUE!"}},{"$f":"IF(ISNUMBER(E38),E38*INDIRECT($B$1&\"!$F$9\")/$G$3,\"\")","v":""},"",{"$f":"IF(B38<INDIRECT($B$1&\"!$C$7\"),H37-G38,\"\")","v":""}]
[null,{"$f":"IF(ISNUMBER(B38),IF(AND(B38<INDIRECT($B$1&\"!$C$7\"),H38>0), B38+0.5,\"\"),\"\")","v":""},"",{"$f":"IF(AND(B39<INDIRECT($B$1&\"!$C$7\"),ISNUMBER(B39)),INDIRECT($B$1&\"!$C$16\")*ERFC(0.5*C39*SQRT(INDIRECT($B$1&\"!$F$10\")/(INDIRECT($B$1&\"!$F$9\")*INDIRECT($B$1&\"!$C$20\")*B39))),\"\")","v":""},{"$f":"(INDIRECT($B$1&\"!$F$15\") -D39)/C39","v":{"$error":"#VALUE!"}},{"$f":"IF(ISNUMBER(E39),E39*INDIRECT($B$1&\"!$F$9\")/$G$3,\"\")","v":""},"",{"$f":"IF(B39<INDIRECT($B$1&\"!$C$7\"),H38-G39,\"\")","v":""}]
[null,{"$f":"IF(ISNUMBER(B39),IF(AND(B39<INDIRECT($B$1&\"!$C$7\"),H39>0), B39+0.5,\"\"),\"\")","v":""},"",{"$f":"IF(AND(B40<INDIRECT($B$1&\"!$C$7\"),ISNUMBER(B40)),INDIRECT($B$1&\"!$C$16\")*ERFC(0.5*C40*SQRT(INDIRECT($B$1&\"!$F$10\")/(INDIRECT($B$1&\"!$F$9\")*INDIRECT($B$1&\"!$C$20\")*B40))),\"\")","v":""},{"$f":"(INDIRECT($B$1&\"!$F$15\") -D40)/C40","v":{"$error":"#VALUE!"}},{"$f":"IF(ISNUMBER(E40),E40*INDIRECT($B$1&\"!$F$9\")/$G$3,\"\")","v":""},"",{"$f":"IF(B40<INDIRECT($B$1&\"!$C$7\"),H39-G40,\"\")","v":""}]
[null,{"$f":"IF(ISNUMBER(B40),IF(AND(B40<INDIRECT($B$1&\"!$C$7\"),H40>0), B40+0.5,\"\"),\"\")","v":""},"",{"$f":"IF(AND(B41<INDIRECT($B$1&\"!$C$7\"),ISNUMBER(B41)),INDIRECT($B$1&\"!$C$16\")*ERFC(0.5*C41*SQRT(INDIRECT($B$1&\"!$F$10\")/(INDIRECT($B$1&\"!$F$9\")*INDIRECT($B$1&\"!$C$20\")*B41))),\"\")","v":""},{"$f":"(INDIRECT($B$1&\"!$F$15\") -D41)/C41","v":{"$error":"#VALUE!"}},{"$f":"IF(ISNUMBER(E41),E41*INDIRECT($B$1&\"!$F$9\")/$G$3,\"\")","v":""},"",{"$f":"IF(B41<INDIRECT($B$1&\"!$C$7\"),H40-G41,\"\")","v":""}]
[null,{"$f":"IF(ISNUMBER(B41),IF(AND(B41<INDIRECT($B$1&\"!$C$7\"),H41>0), B41+0.5,\"\"),\"\")","v":""},"",{"$f":"IF(AND(B42<INDIRECT($B$1&\"!$C$7\"),ISNUMBER(B42)),INDIRECT($B$1&\"!$C$16\")*ERFC(0.5*C42*SQRT(INDIRECT($B$1&\"!$F$10\")/(INDIRECT($B$1&\"!$F$9\")*INDIRECT($B$1&\"!$C$20\")*B42))),\"\")","v":""},{"$f":"(INDIRECT($B$1&\"!$F$15\") -D42)/C42","v":{"$error":"#VALUE!"}},{"$f":"IF(ISNUMBER(E42),E42*INDIRECT($B$1&\"!$F$9\")/$G$3,\"\")","v":""},"",{"$f":"IF(B42<INDIRECT($B$1&\"!$C$7\"),H41-G42,\"\")","v":""}]
[null,{"$f":"IF(ISNUMBER(B42),IF(AND(B42<INDIRECT($B$1&\"!$C$7\"),H42>0), B42+0.5,\"\"),\"\")","v":""},"",{"$f":"IF(AND(B43<INDIRECT($B$1&\"!$C$7\"),ISNUMBER(B43)),INDIRECT($B$1&\"!$C$16\")*ERFC(0.5*C43*SQRT(INDIRECT($B$1&\"!$F$10\")/(INDIRECT($B$1&\"!$F$9\")*INDIRECT($B$1&\"!$C$20\")*B43))),\"\")","v":""},{"$f":"(INDIRECT($B$1&\"!$F$15\") -D43)/C43","v":{"$error":"#VALUE!"}},{"$f":"IF(ISNUMBER(E43),E43*INDIRECT($B$1&\"!$F$9\")/$G$3,\"\")","v":""},"",{"$f":"IF(B43<INDIRECT($B$1&\"!$C$7\"),H42-G43,\"\")","v":""}]
[null,{"$f":"IF(ISNUMBER(B43),IF(AND(B43<INDIRECT($B$1&\"!$C$7\"),H43>0), B43+0.5,\"\"),\"\")","v":""},"",{"$f":"IF(AND(B44<INDIRECT($B$1&\"!$C$7\"),ISNUMBER(B44)),INDIRECT($B$1&\"!$C$16\")*ERFC(0.5*C44*SQRT(INDIRECT($B$1&\"!$F$10\")/(INDIRECT($B$1&\"!$F$9\")*INDIRECT($B$1&\"!$C$20\")*B44))),\"\")","v":""},{"$f":"(INDIRECT($B$1&\"!$F$15\") -D44)/C44","v":{"$error":"#VALUE!"}},{"$f":"IF(ISNUMBER(E44),E44*INDIRECT($B$1&\"!$F$9\")/$G$3,\"\")","v":""},"",{"$f":"IF(B44<INDIRECT($B$1&\"!$C$7\"),H43-G44,\"\")","v":""}]
[null,{"$f":"IF(ISNUMBER(B44),IF(AND(B44<INDIRECT($B$1&\"!$C$7\"),H44>0), B44+0.5,\"\"),\"\")","v":""},"",{"$f":"IF(AND(B45<INDIRECT($B$1&\"!$C$7\"),ISNUMBER(B45)),INDIRECT($B$1&\"!$C$16\")*ERFC(0.5*C45*SQRT(INDIRECT($B$1&\"!$F$10\")/(INDIRECT($B$1&\"!$F$9\")*INDIRECT($B$1&\"!$C$20\")*B45))),\"\")","v":""},{"$f":"(INDIRECT($B$1&\"!$F$15\") -D45)/C45","v":{"$error":"#VALUE!"}},{"$f":"IF(ISNUMBER(E45),E45*INDIRECT($B$1&\"!$F$9\")/$G$3,\"\")","v":""},"",{"$f":"IF(B45<INDIRECT($B$1&\"!$C$7\"),H44-G45,\"\")","v":""}]
[null,{"$f":"IF(ISNUMBER(B45),IF(AND(B45<INDIRECT($B$1&\"!$C$7\"),H45>0), B45+0.5,\"\"),\"\")","v":""},"",{"$f":"IF(AND(B46<INDIRECT($B$1&\"!$C$7\"),ISNUMBER(B46)),INDIRECT($B$1&\"!$C$16\")*ERFC(0.5*C46*SQRT(INDIRECT($B$1&\"!$F$10\")/(INDIRECT($B$1&\"!$F$9\")*INDIRECT($B$1&\"!$C$20\")*B46))),\"\")","v":""},{"$f":"(INDIRECT($B$1&\"!$F$15\") -D46)/C46","v":{"$error":"#VALUE!"}},{"$f":"IF(ISNUMBER(E46),E46*INDIRECT($B$1&\"!$F$9\")/$G$3,\"\")","v":""},"",{"$f":"IF(B46<INDIRECT($B$1&\"!$C$7\"),H45-G46,\"\")","v":""}]
[null,{"$f":"IF(ISNUMBER(B46),IF(AND(B46<INDIRECT($B$1&\"!$C$7\"),H46>0), B46+0.5,\"\"),\"\")","v":""},"",{"$f":"IF(AND(B47<INDIRECT($B$1&\"!$C$7\"),ISNUMBER(B47)),INDIRECT($B$1&\"!$C$16\")*ERFC(0.5*C47*SQRT(INDIRECT($B$1&\"!$F$10\")/(INDIRECT($B$1&\"!$F$9\")*INDIRECT($B$1&\"!$C$20\")*B47))),\"\")","v":""},{"$f":"(INDIRECT($B$1&\"!$F$15\") -D47)/C47","v":{"$error":"#VALUE!"}},{"$f":"IF(ISNUMBER(E47),E47*INDIRECT($B$1&\"!$F$9\")/$G$3,\"\")","v":""},"",{"$f":"IF(B47<INDIRECT($B$1&\"!$C$7\"),H46-G47,\"\")","v":""}]
[null,{"$f":"IF(ISNUMBER(B47),IF(AND(B47<INDIRECT($B$1&\"!$C$7\"),H47>0), B47+0.5,\"\"),\"\")","v":""},"",{"$f":"IF(AND(B48<INDIRECT($B$1&\"!$C$7\"),ISNUMBER(B48)),INDIRECT($B$1&\"!$C$16\")*ERFC(0.5*C48*SQRT(INDIRECT($B$1&\"!$F$10\")/(INDIRECT($B$1&\"!$F$9\")*INDIRECT($B$1&\"!$C$20\")*B48))),\"\")","v":""},{"$f":"(INDIRECT($B$1&\"!$F$15\") -D48)/C48","v":{"$error":"#VALUE!"}},{"$f":"IF(ISNUMBER(E48),E48*INDIRECT($B$1&\"!$F$9\")/$G$3,\"\")","v":""},"",{"$f":"IF(B48<INDIRECT($B$1&\"!$C$7\"),H47-G48,\"\")","v":""}]
[null,{"$f":"IF(ISNUMBER(B48),IF(AND(B48<INDIRECT($B$1&\"!$C$7\"),H48>0), B48+0.5,\"\"),\"\")","v":""},{"$f":"IF(ISNUMBER(B49),H48,\"\")","v":""},{"$f":"IF(AND(B49<INDIRECT($B$1&\"!$C$7\"),ISNUMBER(B49)),INDIRECT($B$1&\"!$C$16\")*ERFC(0.5*C49*SQRT(INDIRECT($B$1&\"!$F$10\")/(INDIRECT($B$1&\"!$F$9\")*INDIRECT($B$1&\"!$C$20\")*B49))),\"\")","v":""},{"$f":"(INDIRECT($B$1&\"!$F$15\") -D49)/C49","v":{"$error":"#VALUE!"}},{"$f":"IF(ISNUMBER(E49),E49*INDIRECT($B$1&\"!$F$9\")/$G$3,\"\")","v":""},{"$f":"IF(ISNUMBER(F49),F49*ABS(B48-B49)/$I$3,\"\")","v":""},{"$f":"IF(B49<INDIRECT($B$1&\"!$C$7\"),H48-G49,\"\")","v":""}]
[null,{"$f":"IF(ISNUMBER(B49),IF(AND(B49<INDIRECT($B$1&\"!$C$7\"),H49>0), B49+0.5,\"\"),\"\")","v":""},"",{"$f":"IF(AND(B50<INDIRECT($B$1&\"!$C$7\"),ISNUMBER(B50)),INDIRECT($B$1&\"!$C$16\")*ERFC(0.5*C50*SQRT(INDIRECT($B$1&\"!$F$10\")/(INDIRECT($B$1&\"!$F$9\")*INDIRECT($B$1&\"!$C$20\")*B50))),\"\")","v":""},{"$f":"(INDIRECT($B$1&\"!$F$15\") -D50)/C50","v":{"$error":"#VALUE!"}},{"$f":"IF(ISNUMBER(E50),E50*INDIRECT($B$1&\"!$F$9\")/$G$3,\"\")","v":""},"",{"$f":"IF(B50<INDIRECT($B$1&\"!$C$7\"),H49-G50,\"\")","v":""}]
[null,{"$f":"IF(ISNUMBER(B50),IF(AND(B50<INDIRECT($B$1&\"!$C$7\"),H50>0), B50+0.5,\"\"),\"\")","v":""},"",{"$f":"IF(AND(B51<INDIRECT($B$1&\"!$C$7\"),ISNUMBER(B51)),INDIRECT($B$1&\"!$C$16\")*ERFC(0.5*C51*SQRT(INDIRECT($B$1&\"!$F$10\")/(INDIRECT($B$1&\"!$F$9\")*INDIRECT($B$1&\"!$C$20\")*B51))),\"\")","v":""},{"$f":"(INDIRECT($B$1&\"!$F$15\") -D51)/C51","v":{"$error":"#VALUE!"}},{"$f":"IF(ISNUMBER(E51),E51*INDIRECT($B$1&\"!$F$9\")/$G$3,\"\")","v":""},"",{"$f":"IF(B51<INDIRECT($B$1&\"!$C$7\"),H50-G51,\"\")","v":""}]
[null,{"$f":"IF(ISNUMBER(B51),IF(AND(B51<INDIRECT($B$1&\"!$C$7\"),H51>0), B51+0.5,\"\"),\"\")","v":""},"",{"$f":"IF(AND(B52<INDIRECT($B$1&\"!$C$7\"),ISNUMBER(B52)),INDIRECT($B$1&\"!$C$16\")*ERFC(0.5*C52*SQRT(INDIRECT($B$1&\"!$F$10\")/(INDIRECT($B$1&\"!$F$9\")*INDIRECT($B$1&\"!$C$20\")*B52))),\"\")","v":""},{"$f":"(INDIRECT($B$1&\"!$F$15\") -D52)/C52","v":{"$error":"#VALUE!"}},{"$f":"IF(ISNUMBER(E52),E52*INDIRECT($B$1&\"!$F$9\")/$G$3,\"\")","v":""},"",{"$f":"IF(B52<INDIRECT($B$1&\"!$C$7\"),H51-G52,\"\")","v":""}]
[null,{"$f":"IF(ISNUMBER(B52),IF(AND(B52<INDIRECT($B$1&\"!$C$7\"),H52>0), B52+0.5,\"\"),\"\")","v":""},"",{"$f":"IF(AND(B53<INDIRECT($B$1&\"!$C$7\"),ISNUMBER(B53)),INDIRECT($B$1&\"!$C$16\")*ERFC(0.5*C53*SQRT(INDIRECT($B$1&\"!$F$10\")/(INDIRECT($B$1&\"!$F$9\")*INDIRECT($B$1&\"!$C$20\")*B53))),\"\")","v":""},{"$f":"(INDIRECT($B$1&\"!$F$15\") -D53)/C53","v":{"$error":"#VALUE!"}},{"$f":"IF(ISNUMBER(E53),E53*INDIRECT($B$1&\"!$F$9\")/$G$3,\"\")","v":""},"",{"$f":"IF(B53<INDIRECT($B$1&\"!$C$7\"),H52-G53,\"\")","v":""}]
[null,{"$f":"IF(ISNUMBER(B53),IF(AND(B53<INDIRECT($B$1&\"!$C$7\"),H53>0), B53+0.5,\"\"),\"\")","v":""},"",{"$f":"IF(AND(B54<INDIRECT($B$1&\"!$C$7\"),ISNUMBER(B54)),INDIRECT($B$1&\"!$C$16\")*ERFC(0.5*C54*SQRT(INDIRECT($B$1&\"!$F$10\")/(INDIRECT($B$1&\"!$F$9\")*INDIRECT($B$1&\"!$C$20\")*B54))),\"\")","v":""},{"$f":"(INDIRECT($B$1&\"!$F$15\") -D54)/C54","v":{"$error":"#VALUE!"}},{"$f":"IF(ISNUMBER(E54),E54*INDIRECT($B$1&\"!$F$9\")/$G$3,\"\")","v":""},"",{"$f":"IF(B54<INDIRECT($B$1&\"!$C$7\"),H53-G54,\"\")","v":""}]
[null,{"$f":"IF(ISNUMBER(B54),IF(AND(B54<INDIRECT($B$1&\"!$C$7\"),H54>0), B54+0.5,\"\"),\"\")","v":""},"",{"$f":"IF(AND(B55<INDIRECT($B$1&\"!$C$7\"),ISNUMBER(B55)),INDIRECT($B$1&\"!$C$16\")*ERFC(0.5*C55*SQRT(INDIRECT($B$1&\"!$F$10\")/(INDIRECT($B$1&\"!$F$9\")*INDIRECT($B$1&\"!$C$20\")*B55))),\"\")","v":""},{"$f":"(INDIRECT($B$1&\"!$F$15\") -D55)/C55","v":{"$error":"#VALUE!"}},{"$f":"IF(ISNUMBER(E55),E55*INDIRECT($B$1&\"!$F$9\")/$G$3,\"\")","v":""},"",{"$f":"IF(B55<INDIRECT($B$1&\"!$C$7\"),H54-G55,\"\")","v":""}]
[null,{"$f":"IF(ISNUMBER(B55),IF(AND(B55<INDIRECT($B$1&\"!$C$7\"),H55>0), B55+0.5,\"\"),\"\")","v":""},"",{"$f":"IF(AND(B56<INDIRECT($B$1&\"!$C$7\"),ISNUMBER(B56)),INDIRECT($B$1&\"!$C$16\")*ERFC(0.5*C56*SQRT(INDIRECT($B$1&\"!$F$10\")/(INDIRECT($B$1&\"!$F$9\")*INDIRECT($B$1&\"!$C$20\")*B56))),\"\")","v":""},{"$f":"(INDIRECT($B$1&\"!$F$15\") -D56)/C56","v":{"$error":"#VALUE!"}},{"$f":"IF(ISNUMBER(E56),E56*INDIRECT($B$1&\"!$F$9\")/$G$3,\"\")","v":""},"",{"$f":"IF(B56<INDIRECT($B$1&\"!$C$7\"),H55-G56,\"\")","v":""}]
[null,{"$f":"IF(ISNUMBER(B56),IF(AND(B56<INDIRECT($B$1&\"!$C$7\"),H56>0), B56+0.5,\"\"),\"\")","v":""},"",{"$f":"IF(AND(B57<INDIRECT($B$1&\"!$C$7\"),ISNUMBER(B57)),INDIRECT($B$1&\"!$C$16\")*ERFC(0.5*C57*SQRT(INDIRECT($B$1&\"!$F$10\")/(INDIRECT($B$1&\"!$F$9\")*INDIRECT($B$1&\"!$C$20\")*B57))),\"\")","v":""},{"$f":"(INDIRECT($B$1&\"!$F$15\") -D57)/C57","v":{"$error":"#VALUE!"}},{"$f":"IF(ISNUMBER(E57),E57*INDIRECT($B$1&\"!$F$9\")/$G$3,\"\")","v":""},"",{"$f":"IF(B57<INDIRECT($B$1&\"!$C$7\"),H56-G57,\"\")","v":""}]
[null,{"$f":"IF(ISNUMBER(B57),IF(AND(B57<INDIRECT($B$1&\"!$C$7\"),H57>0), B57+0.5,\"\"),\"\")","v":""},"",{"$f":"IF(AND(B58<INDIRECT($B$1&\"!$C$7\"),ISNUMBER(B58)),INDIRECT($B$1&\"!$C$16\")*ERFC(0.5*C58*SQRT(INDIRECT($B$1&\"!$F$10\")/(INDIRECT($B$1&\"!$F$9\")*INDIRECT($B$1&\"!$C$20\")*B58))),\"\")","v":""},{"$f":"(INDIRECT($B$1&\"!$F$15\") -D58)/C58","v":{"$error":"#VALUE!"}},{"$f":"IF(ISNUMBER(E58),E58*INDIRECT($B$1&\"!$F$9\")/$G$3,\"\")","v":""},"",{"$f":"IF(B58<INDIRECT($B$1&\"!$C$7\"),H57-G58,\"\")","v":""}]
[null,{"$f":"IF(ISNUMBER(B58),IF(AND(B58<INDIRECT($B$1&\"!$C$7\"),H58>0), B58+0.5,\"\"),\"\")","v":""},"",{"$f":"IF(AND(B59<INDIRECT($B$1&\"!$C$7\"),ISNUMBER(B59)),INDIRECT($B$1&\"!$C$16\")*ERFC(0.5*C59*SQRT(INDIRECT($B$1&\"!$F$10\")/(INDIRECT($B$1&\"!$F$9\")*INDIRECT($B$1&\"!$C$20\")*B59))),\"\")","v":""},{"$f":"(INDIRECT($B$1&\"!$F$15\") -D59)/C59","v":{"$error":"#VALUE!"}},{"$f":"IF(ISNUMBER(E59),E59*INDIRECT($B$1&\"!$F$9\")/$G$3,\"\")","v":""},"",{"$f":"IF(B59<INDIRECT($B$1&\"!$C$7\"),H58-G59,\"\")","v":""}]
[null,{"$f":"IF(ISNUMBER(B59),IF(AND(B59<INDIRECT($B$1&\"!$C$7\"),H59>0), B59+0.5,\"\"),\"\")","v":""},"",{"$f":"IF(AND(B60<INDIRECT($B$1&\"!$C$7\"),ISNUMBER(B60)),INDIRECT($B$1&\"!$C$16\")*ERFC(0.5*C60*SQRT(INDIRECT($B$1&\"!$F$10\")/(INDIRECT($B$1&\"!$F$9\")*INDIRECT($B$1&\"!$C$20\")*B60))),\"\")","v":""},{"$f":"(INDIRECT($B$1&\"!$F$15\") -D60)/C60","v":{"$error":"#VALUE!"}},{"$f":"IF(ISNUMBER(E60),E60*INDIRECT($B$1&\"!$F$9\")/$G$3,\"\")","v":""},"",{"$f":"IF(B60<INDIRECT($B$1&\"!$C$7\"),H59-G60,\"\")","v":""}]
[null,{"$f":"IF(ISNUMBER(B60),IF(AND(B60<INDIRECT($B$1&\"!$C$7\"),H60>0), B60+0.5,\"\"),\"\")","v":""},"",{"$f":"IF(AND(B61<INDIRECT($B$1&\"!$C$7\"),ISNUMBER(B61)),INDIRECT($B$1&\"!$C$16\")*ERFC(0.5*C61*SQRT(INDIRECT($B$1&\"!$F$10\")/(INDIRECT($B$1&\"!$F$9\")*INDIRECT($B$1&\"!$C$20\")*B61))),\"\")","v":""},{"$f":"(INDIRECT($B$1&\"!$F$15\") -D61)/C61","v":{"$error":"#VALUE!"}},{"$f":"IF(ISNUMBER(E61),E61*INDIRECT($B$1&\"!$F$9\")/$G$3,\"\")","v":""},"",{"$f":"IF(B61<INDIRECT($B$1&\"!$C$7\"),H60-G61,\"\")","v":""}]
[null,{"$f":"IF(ISNUMBER(B61),IF(AND(B61<INDIRECT($B$1&\"!$C$7\"),H61>0), B61+0.5,\"\"),\"\")","v":""},"",{"$f":"IF(AND(B62<INDIRECT($B$1&\"!$C$7\"),ISNUMBER(B62)),INDIRECT($B$1&\"!$C$16\")*ERFC(0.5*C62*SQRT(INDIRECT($B$1&\"!$F$10\")/(INDIRECT($B$1&\"!$F$9\")*INDIRECT($B$1&\"!$C$20\")*B62))),\"\")","v":""},{"$f":"(INDIRECT($B$1&\"!$F$15\") -D62)/C62","v":{"$error":"#VALUE!"}},{"$f":"IF(ISNUMBER(E62),E62*INDIRECT($B$1&\"!$F$9\")/$G$3,\"\")","v":""},"",{"$f":"IF(B62<INDIRECT($B$1&\"!$C$7\"),H61-G62,\"\")","v":""}]
[null,{"$f":"IF(ISNUMBER(B62),IF(AND(B62<INDIRECT($B$1&\"!$C$7\"),H62>0), B62+0.5,\"\"),\"\")","v":""},"",{"$f":"IF(AND(B63<INDIRECT($B$1&\"!$C$7\"),ISNUMBER(B63)),INDIRECT($B$1&\"!$C$16\")*ERFC(0.5*C63*SQRT(INDIRECT($B$1&\"!$F$10\")/(INDIRECT($B$1&\"!$F$9\")*INDIRECT($B$1&\"!$C$20\")*B63))),\"\")","v":""},{"$f":"(INDIRECT($B$1&\"!$F$15\") -D63)/C63","v":{"$error":"#VALUE!"}},{"$f":"IF(ISNUMBER(E63),E63*INDIRECT($B$1&\"!$F$9\")/$G$3,\"\")","v":""},"",{"$f":"IF(B63<INDIRECT($B$1&\"!$C$7\"),H62-G63,\"\")","v":""}]
[null,{"$f":"IF(ISNUMBER(B63),IF(AND(B63<INDIRECT($B$1&\"!$C$7\"),H63>0), B63+0.5,\"\"),\"\")","v":""},"",{"$f":"IF(AND(B64<INDIRECT($B$1&\"!$C$7\"),ISNUMBER(B64)),INDIRECT($B$1&\"!$C$16\")*ERFC(0.5*C64*SQRT(INDIRECT($B$1&\"!$F$10\")/(INDIRECT($B$1&\"!$F$9\")*INDIRECT($B$1&\"!$C$20\")*B64))),\"\")","v":""},{"$f":"(INDIRECT($B$1&\"!$F$15\") -D64)/C64","v":{"$error":"#VALUE!"}},{"$f":"IF(ISNUMBER(E64),E64*INDIRECT($B$1&\"!$F$9\")/$G$3,\"\")","v":""},"",{"$f":"IF(B64<INDIRECT($B$1&\"!$C$7\"),H63-G64,\"\")","v":""}]
[null,{"$f":"IF(ISNUMBER(B64),IF(AND(B64<INDIRECT($B$1&\"!$C$7\"),H64>0), B64+0.5,\"\"),\"\")","v":""},"",{"$f":"IF(AND(B65<INDIRECT($B$1&\"!$C$7\"),ISNUMBER(B65)),INDIRECT($B$1&\"!$C$16\")*ERFC(0.5*C65*SQRT(INDIRECT($B$1&\"!$F$10\")/(INDIRECT($B$1&\"!$F$9\")*INDIRECT($B$1&\"!$C$20\")*B65))),\"\")","v":""},{"$f":"(INDIRECT($B$1&\"!$F$15\") -D65)/C65","v":{"$error":"#VALUE!"}},{"$f":"IF(ISNUMBER(E65),E65*INDIRECT($B$1&\"!$F$9\")/$G$3,\"\")","v":""},"",{"$f":"IF(B65<INDIRECT($B$1&\"!$C$7\"),H64-G65,\"\")","v":""}]
[null,{"$f":"IF(ISNUMBER(B65),IF(AND(B65<INDIRECT($B$1&\"!$C$7\"),H65>0), B65+0.5,\"\"),\"\")","v":""},"",{"$f":"IF(AND(B66<INDIRECT($B$1&\"!$C$7\"),ISNUMBER(B66)),INDIRECT($B$1&\"!$C$16\")*ERFC(0.5*C66*SQRT(INDIRECT($B$1&\"!$F$10\")/(INDIRECT($B$1&\"!$F$9\")*INDIRECT($B$1&\"!$C$20\")*B66))),\"\")","v":""},{"$f":"(INDIRECT($B$1&\"!$F$15\") -D66)/C66","v":{"$error":"#VALUE!"}},{"$f":"IF(ISNUMBER(E66),E66*INDIRECT($B$1&\"!$F$9\")/$G$3,\"\")","v":""},"",{"$f":"IF(B66<INDIRECT($B$1&\"!$C$7\"),H65-G66,\"\")","v":""}]
[null,{"$f":"IF(ISNUMBER(B66),IF(AND(B66<INDIRECT($B$1&\"!$C$7\"),H66>0), B66+0.5,\"\"),\"\")","v":""},"",{"$f":"IF(AND(B67<INDIRECT($B$1&\"!$C$7\"),ISNUMBER(B67)),INDIRECT($B$1&\"!$C$16\")*ERFC(0.5*C67*SQRT(INDIRECT($B$1&\"!$F$10\")/(INDIRECT($B$1&\"!$F$9\")*INDIRECT($B$1&\"!$C$20\")*B67))),\"\")","v":""},{"$f":"(INDIRECT($B$1&\"!$F$15\") -D67)/C67","v":{"$error":"#VALUE!"}},{"$f":"IF(ISNUMBER(E67),E67*INDIRECT($B$1&\"!$F$9\")/$G$3,\"\")","v":""},"",{"$f":"IF(B67<INDIRECT($B$1&\"!$C$7\"),H66-G67,\"\")","v":""}]
[null,{"$f":"IF(ISNUMBER(B67),IF(AND(B67<INDIRECT($B$1&\"!$C$7\"),H67>0), B67+0.5,\"\"),\"\")","v":""},"",{"$f":"IF(AND(B68<INDIRECT($B$1&\"!$C$7\"),ISNUMBER(B68)),INDIRECT($B$1&\"!$C$16\")*ERFC(0.5*C68*SQRT(INDIRECT($B$1&\"!$F$10\")/(INDIRECT($B$1&\"!$F$9\")*INDIRECT($B$1&\"!$C$20\")*B68))),\"\")","v":""},{"$f":"(INDIRECT($B$1&\"!$F$15\") -D68)/C68","v":{"$error":"#VALUE!"}},{"$f":"IF(ISNUMBER(E68),E68*INDIRECT($B$1&\"!$F$9\")/$G$3,\"\")","v":""},"",{"$f":"IF(B68<INDIRECT($B$1&\"!$C$7\"),H67-G68,\"\")","v":""}]
[null,{"$f":"IF(ISNUMBER(B68),IF(AND(B68<INDIRECT($B$1&\"!$C$7\"),H68>0), B68+0.5,\"\"),\"\")","v":""},"",{"$f":"IF(AND(B69<INDIRECT($B$1&\"!$C$7\"),ISNUMBER(B69)),INDIRECT($B$1&\"!$C$16\")*ERFC(0.5*C69*SQRT(INDIRECT($B$1&\"!$F$10\")/(INDIRECT($B$1&\"!$F$9\")*INDIRECT($B$1&\"!$C$20\")*B69))),\"\")","v":""},{"$f":"(INDIRECT($B$1&\"!$F$15\") -D69)/C69","v":{"$error":"#VALUE!"}},{"$f":"IF(ISNUMBER(E69),E69*INDIRECT($B$1&\"!$F$9\")/$G$3,\"\")","v":""},"",{"$f":"IF(B69<INDIRECT($B$1&\"!$C$7\"),H68-G69,\"\")","v":""}]
[null,{"$f":"IF(ISNUMBER(B69),IF(AND(B69<INDIRECT($B$1&\"!$C$7\"),H69>0), B69+0.5,\"\"),\"\")","v":""},"",{"$f":"IF(AND(B70<INDIRECT($B$1&\"!$C$7\"),ISNUMBER(B70)),INDIRECT($B$1&\"!$C$16\")*ERFC(0.5*C70*SQRT(INDIRECT($B$1&\"!$F$10\")/(INDIRECT($B$1&\"!$F$9\")*INDIRECT($B$1&\"!$C$20\")*B70))),\"\")","v":""},{"$f":"(INDIRECT($B$1&\"!$F$15\") -D70)/C70","v":{"$error":"#VALUE!"}},{"$f":"IF(ISNUMBER(E70),E70*INDIRECT($B$1&\"!$F$9\")/$G$3,\"\")","v":""},"",{"$f":"IF(B70<INDIRECT($B$1&\"!$C$7\"),H69-G70,\"\")","v":""}]
[null,{"$f":"IF(ISNUMBER(B70),IF(AND(B70<INDIRECT($B$1&\"!$C$7\"),H70>0), B70+0.5,\"\"),\"\")","v":""},"",{"$f":"IF(AND(B71<INDIRECT($B$1&\"!$C$7\"),ISNUMBER(B71)),INDIRECT($B$1&\"!$C$16\")*ERFC(0.5*C71*SQRT(INDIRECT($B$1&\"!$F$10\")/(INDIRECT($B$1&\"!$F$9\")*INDIRECT($B$1&\"!$C$20\")*B71))),\"\")","v":""},{"$f":"(INDIRECT($B$1&\"!$F$15\") -D71)/C71","v":{"$error":"#VALUE!"}},{"$f":"IF(ISNUMBER(E71),E71*INDIRECT($B$1&\"!$F$9\")/$G$3,\"\")","v":""},"",{"$f":"IF(B71<INDIRECT($B$1&\"!$C$7\"),H70-G71,\"\")","v":""}]
[null,{"$f":"IF(ISNUMBER(B71),IF(AND(B71<INDIRECT($B$1&\"!$C$7\"),H71>0), B71+0.5,\"\"),\"\")","v":""},"",{"$f":"IF(AND(B72<INDIRECT($B$1&\"!$C$7\"),ISNUMBER(B72)),INDIRECT($B$1&\"!$C$16\")*ERFC(0.5*C72*SQRT(INDIRECT($B$1&\"!$F$10\")/(INDIRECT($B$1&\"!$F$9\")*INDIRECT($B$1&\"!$C$20\")*B72))),\"\")","v":""},{"$f":"(INDIRECT($B$1&\"!$F$15\") -D72)/C72","v":{"$error":"#VALUE!"}},{"$f":"IF(ISNUMBER(E72),E72*INDIRECT($B$1&\"!$F$9\")/$G$3,\"\")","v":""},"",{"$f":"IF(B72<INDIRECT($B$1&\"!$C$7\"),H71-G72,\"\")","v":""}]
[null,{"$f":"IF(ISNUMBER(B72),IF(AND(B72<INDIRECT($B$1&\"!$C$7\"),H72>0), B72+0.5,\"\"),\"\")","v":""},"",{"$f":"IF(AND(B73<INDIRECT($B$1&\"!$C$7\"),ISNUMBER(B73)),INDIRECT($B$1&\"!$C$16\")*ERFC(0.5*C73*SQRT(INDIRECT($B$1&\"!$F$10\")/(INDIRECT($B$1&\"!$F$9\")*INDIRECT($B$1&\"!$C$20\")*B73))),\"\")","v":""},{"$f":"(INDIRECT($B$1&\"!$F$15\") -D73)/C73","v":{"$error":"#VALUE!"}},{"$f":"IF(ISNUMBER(E73),E73*INDIRECT($B$1&\"!$F$9\")/$G$3,\"\")","v":""},"",{"$f":"IF(B73<INDIRECT($B$1&\"!$C$7\"),H72-G73,\"\")","v":""}]
[null,{"$f":"IF(ISNUMBER(B73),IF(AND(B73<INDIRECT($B$1&\"!$C$7\"),H73>0), B73+0.5,\"\"),\"\")","v":""},"",{"$f":"IF(AND(B74<INDIRECT($B$1&\"!$C$7\"),ISNUMBER(B74)),INDIRECT($B$1&\"!$C$16\")*ERFC(0.5*C74*SQRT(INDIRECT($B$1&\"!$F$10\")/(INDIRECT($B$1&\"!$F$9\")*INDIRECT($B$1&\"!$C$20\")*B74))),\"\")","v":""},{"$f":"(INDIRECT($B$1&\"!$F$15\") -D74)/C74","v":{"$error":"#VALUE!"}},{"$f":"IF(ISNUMBER(E74),E74*INDIRECT($B$1&\"!$F$9\")/$G$3,\"\")","v":""},"",{"$f":"IF(B74<INDIRECT($B$1&\"!$C$7\"),H73-G74,\"\")","v":""}]
[null,{"$f":"IF(ISNUMBER(B74),IF(AND(B74<INDIRECT($B$1&\"!$C$7\"),H74>0), B74+0.5,\"\"),\"\")","v":""},"",{"$f":"IF(AND(B75<INDIRECT($B$1&\"!$C$7\"),ISNUMBER(B75)),INDIRECT($B$1&\"!$C$16\")*ERFC(0.5*C75*SQRT(INDIRECT($B$1&\"!$F$10\")/(INDIRECT($B$1&\"!$F$9\")*INDIRECT($B$1&\"!$C$20\")*B75))),\"\")","v":""},{"$f":"(INDIRECT($B$1&\"!$F$15\") -D75)/C75","v":{"$error":"#VALUE!"}},{"$f":"IF(ISNUMBER(E75),E75*INDIRECT($B$1&\"!$F$9\")/$G$3,\"\")","v":""},"",{"$f":"IF(B75<INDIRECT($B$1&\"!$C$7\"),H74-G75,\"\")","v":""}]
[null,{"$f":"IF(ISNUMBER(B75),IF(AND(B75<INDIRECT($B$1&\"!$C$7\"),H75>0), B75+0.5,\"\"),\"\")","v":""},"",{"$f":"IF(AND(B76<INDIRECT($B$1&\"!$C$7\"),ISNUMBER(B76)),INDIRECT($B$1&\"!$C$16\")*ERFC(0.5*C76*SQRT(INDIRECT($B$1&\"!$F$10\")/(INDIRECT($B$1&\"!$F$9\")*INDIRECT($B$1&\"!$C$20\")*B76))),\"\")","v":""},{"$f":"(INDIRECT($B$1&\"!$F$15\") -D76)/C76","v":{"$error":"#VALUE!"}},{"$f":"IF(ISNUMBER(E76),E76*INDIRECT($B$1&\"!$F$9\")/$G$3,\"\")","v":""},"",{"$f":"IF(B76<INDIRECT($B$1&\"!$C$7\"),H75-G76,\"\")","v":""}]
[null,{"$f":"IF(ISNUMBER(B76),IF(AND(B76<INDIRECT($B$1&\"!$C$7\"),H76>0), B76+0.5,\"\"),\"\")","v":""},"",{"$f":"IF(AND(B77<INDIRECT($B$1&\"!$C$7\"),ISNUMBER(B77)),INDIRECT($B$1&\"!$C$16\")*ERFC(0.5*C77*SQRT(INDIRECT($B$1&\"!$F$10\")/(INDIRECT($B$1&\"!$F$9\")*INDIRECT($B$1&\"!$C$20\")*B77))),\"\")","v":""},{"$f":"(INDIRECT($B$1&\"!$F$15\") -D77)/C77","v":{"$error":"#VALUE!"}},{"$f":"IF(ISNUMBER(E77),E77*INDIRECT($B$1&\"!$F$9\")/$G$3,\"\")","v":""},"",{"$f":"IF(B77<INDIRECT($B$1&\"!$C$7\"),H76-G77,\"\")","v":""}]
[null,{"$f":"IF(ISNUMBER(B77),IF(AND(B77<INDIRECT($B$1&\"!$C$7\"),H77>0), B77+0.5,\"\"),\"\")","v":""},"",{"$f":"IF(AND(B78<INDIRECT($B$1&\"!$C$7\"),ISNUMBER(B78)),INDIRECT($B$1&\"!$C$16\")*ERFC(0.5*C78*SQRT(INDIRECT($B$1&\"!$F$10\")/(INDIRECT($B$1&\"!$F$9\")*INDIRECT($B$1&\"!$C$20\")*B78))),\"\")","v":""},{"$f":"(INDIRECT($B$1&\"!$F$15\") -D78)/C78","v":{"$error":"#VALUE!"}},{"$f":"IF(ISNUMBER(E78),E78*INDIRECT($B$1&\"!$F$9\")/$G$3,\"\")","v":""},"",{"$f":"IF(B78<INDIRECT($B$1&\"!$C$7\"),H77-G78,\"\")","v":""}]
[null,{"$f":"IF(ISNUMBER(B78),IF(AND(B78<INDIRECT($B$1&\"!$C$7\"),H78>0), B78+0.5,\"\"),\"\")","v":""},"",{"$f":"IF(AND(B79<INDIRECT($B$1&\"!$C$7\"),ISNUMBER(B79)),INDIRECT($B$1&\"!$C$16\")*ERFC(0.5*C79*SQRT(INDIRECT($B$1&\"!$F$10\")/(INDIRECT($B$1&\"!$F$9\")*INDIRECT($B$1&\"!$C$20\")*B79))),\"\")","v":""},{"$f":"(INDIRECT($B$1&\"!$F$15\") -D79)/C79","v":{"$error":"#VALUE!"}},{"$f":"IF(ISNUMBER(E79),E79*INDIRECT($B$1&\"!$F$9\")/$G$3,\"\")","v":""},"",{"$f":"IF(B79<INDIRECT($B$1&\"!$C$7\"),H78-G79,\"\")","v":""}]
[null,{"$f":"IF(ISNUMBER(B79),IF(AND(B79<INDIRECT($B$1&\"!$C$7\"),H79>0), B79+0.5,\"\"),\"\")","v":""},"",{"$f":"IF(AND(B80<INDIRECT($B$1&\"!$C$7\"),ISNUMBER(B80)),INDIRECT($B$1&\"!$C$16\")*ERFC(0.5*C80*SQRT(INDIRECT($B$1&\"!$F$10\")/(INDIRECT($B$1&\"!$F$9\")*INDIRECT($B$1&\"!$C$20\")*B80))),\"\")","v":""},{"$f":"(INDIRECT($B$1&\"!$F$15\") -D80)/C80","v":{"$error":"#VALUE!"}},{"$f":"IF(ISNUMBER(E80),E80*INDIRECT($B$1&\"!$F$9\")/$G$3,\"\")","v":""},"",{"$f":"IF(B80<INDIRECT($B$1&\"!$C$7\"),H79-G80,\"\")","v":""}]
[null,{"$f":"IF(ISNUMBER(B80),IF(AND(B80<INDIRECT($B$1&\"!$C$7\"),H80>0), B80+0.5,\"\"),\"\")","v":""},"",{"$f":"IF(AND(B81<INDIRECT($B$1&\"!$C$7\"),ISNUMBER(B81)),INDIRECT($B$1&\"!$C$16\")*ERFC(0.5*C81*SQRT(INDIRECT($B$1&\"!$F$10\")/(INDIRECT($B$1&\"!$F$9\")*INDIRECT($B$1&\"!$C$20\")*B81))),\"\")","v":""},{"$f":"(INDIRECT($B$1&\"!$F$15\") -D81)/C81","v":{"$error":"#VALUE!"}},{"$f":"IF(ISNUMBER(E81),E81*INDIRECT($B$1&\"!$F$9\")/$G$3,\"\")","v":""},"",{"$f":"IF(B81<INDIRECT($B$1&\"!$C$7\"),H80-G81,\"\")","v":""}]
[null,{"$f":"IF(ISNUMBER(B81),IF(AND(B81<INDIRECT($B$1&\"!$C$7\"),H81>0), B81+0.5,\"\"),\"\")","v":""},"",{"$f":"IF(AND(B82<INDIRECT($B$1&\"!$C$7\"),ISNUMBER(B82)),INDIRECT($B$1&\"!$C$16\")*ERFC(0.5*C82*SQRT(INDIRECT($B$1&\"!$F$10\")/(INDIRECT($B$1&\"!$F$9\")*INDIRECT($B$1&\"!$C$20\")*B82))),\"\")","v":""},{"$f":"(INDIRECT($B$1&\"!$F$15\") -D82)/C82","v":{"$error":"#VALUE!"}},{"$f":"IF(ISNUMBER(E82),E82*INDIRECT($B$1&\"!$F$9\")/$G$3,\"\")","v":""},"",{"$f":"IF(B82<INDIRECT($B$1&\"!$C$7\"),H81-G82,\"\")","v":""}]
[null,{"$f":"IF(ISNUMBER(B82),IF(AND(B82<INDIRECT($B$1&\"!$C$7\"),H82>0), B82+0.5,\"\"),\"\")","v":""},"",{"$f":"IF(AND(B83<INDIRECT($B$1&\"!$C$7\"),ISNUMBER(B83)),INDIRECT($B$1&\"!$C$16\")*ERFC(0.5*C83*SQRT(INDIRECT($B$1&\"!$F$10\")/(INDIRECT($B$1&\"!$F$9\")*INDIRECT($B$1&\"!$C$20\")*B83))),\"\")","v":""},{"$f":"(INDIRECT($B$1&\"!$F$15\") -D83)/C83","v":{"$error":"#VALUE!"}},{"$f":"IF(ISNUMBER(E83),E83*INDIRECT($B$1&\"!$F$9\")/$G$3,\"\")","v":""},"",{"$f":"IF(B83<INDIRECT($B$1&\"!$C$7\"),H82-G83,\"\")","v":""}]
[null,{"$f":"IF(ISNUMBER(B83),IF(AND(B83<INDIRECT($B$1&\"!$C$7\"),H83>0), B83+0.5,\"\"),\"\")","v":""},"",{"$f":"IF(AND(B84<INDIRECT($B$1&\"!$C$7\"),ISNUMBER(B84)),INDIRECT($B$1&\"!$C$16\")*ERFC(0.5*C84*SQRT(INDIRECT($B$1&\"!$F$10\")/(INDIRECT($B$1&\"!$F$9\")*INDIRECT($B$1&\"!$C$20\")*B84))),\"\")","v":""},{"$f":"(INDIRECT($B$1&\"!$F$15\") -D84)/C84","v":{"$error":"#VALUE!"}},{"$f":"IF(ISNUMBER(E84),E84*INDIRECT($B$1&\"!$F$9\")/$G$3,\"\")","v":""},"",{"$f":"IF(B84<INDIRECT($B$1&\"!$C$7\"),H83-G84,\"\")","v":""}]
[null,{"$f":"IF(ISNUMBER(B84),IF(AND(B84<INDIRECT($B$1&\"!$C$7\"),H84>0), B84+0.5,\"\"),\"\")","v":""},"",{"$f":"IF(AND(B85<INDIRECT($B$1&\"!$C$7\"),ISNUMBER(B85)),INDIRECT($B$1&\"!$C$16\")*ERFC(0.5*C85*SQRT(INDIRECT($B$1&\"!$F$10\")/(INDIRECT($B$1&\"!$F$9\")*INDIRECT($B$1&\"!$C$20\")*B85))),\"\")","v":""},{"$f":"(INDIRECT($B$1&\"!$F$15\") -D85)/C85","v":{"$error":"#VALUE!"}},{"$f":"IF(ISNUMBER(E85),E85*INDIRECT($B$1&\"!$F$9\")/$G$3,\"\")","v":""},"",{"$f":"IF(B85<INDIRECT($B$1&\"!$C$7\"),H84-G85,\"\")","v":""}]
[null,{"$f":"IF(ISNUMBER(B85),IF(AND(B85<INDIRECT($B$1&\"!$C$7\"),H85>0), B85+0.5,\"\"),\"\")","v":""},"",{"$f":"IF(AND(B86<INDIRECT($B$1&\"!$C$7\"),ISNUMBER(B86)),INDIRECT($B$1&\"!$C$16\")*ERFC(0.5*C86*SQRT(INDIRECT($B$1&\"!$F$10\")/(INDIRECT($B$1&\"!$F$9\")*INDIRECT($B$1&\"!$C$20\")*B86))),\"\")","v":""},{"$f":"(INDIRECT($B$1&\"!$F$15\") -D86)/C86","v":{"$error":"#VALUE!"}},{"$f":"IF(ISNUMBER(E86),E86*INDIRECT($B$1&\"!$F$9\")/$G$3,\"\")","v":""},"",{"$f":"IF(B86<INDIRECT($B$1&\"!$C$7\"),H85-G86,\"\")","v":""}]
[null,{"$f":"IF(ISNUMBER(B86),IF(AND(B86<INDIRECT($B$1&\"!$C$7\"),H86>0), B86+0.5,\"\"),\"\")","v":""},"",{"$f":"IF(AND(B87<INDIRECT($B$1&\"!$C$7\"),ISNUMBER(B87)),INDIRECT($B$1&\"!$C$16\")*ERFC(0.5*C87*SQRT(INDIRECT($B$1&\"!$F$10\")/(INDIRECT($B$1&\"!$F$9\")*INDIRECT($B$1&\"!$C$20\")*B87))),\"\")","v":""},{"$f":"(INDIRECT($B$1&\"!$F$15\") -D87)/C87","v":{"$error":"#VALUE!"}},{"$f":"IF(ISNUMBER(E87),E87*INDIRECT($B$1&\"!$F$9\")/$G$3,\"\")","v":""},"",{"$f":"IF(B87<INDIRECT($B$1&\"!$C$7\"),H86-G87,\"\")","v":""}]
[null,{"$f":"IF(ISNUMBER(B87),IF(AND(B87<INDIRECT($B$1&\"!$C$7\"),H87>0), B87+0.5,\"\"),\"\")","v":""},"",{"$f":"IF(AND(B88<INDIRECT($B$1&\"!$C$7\"),ISNUMBER(B88)),INDIRECT($B$1&\"!$C$16\")*ERFC(0.5*C88*SQRT(INDIRECT($B$1&\"!$F$10\")/(INDIRECT($B$1&\"!$F$9\")*INDIRECT($B$1&\"!$C$20\")*B88))),\"\")","v":""},{"$f":"(INDIRECT($B$1&\"!$F$15\") -D88)/C88","v":{"$error":"#VALUE!"}},{"$f":"IF(ISNUMBER(E88),E88*INDIRECT($B$1&\"!$F$9\")/$G$3,\"\")","v":""},"",{"$f":"IF(B88<INDIRECT($B$1&\"!$C$7\"),H87-G88,\"\")","v":""}]
[null,{"$f":"IF(ISNUMBER(B88),IF(AND(B88<INDIRECT($B$1&\"!$C$7\"),H88>0), B88+0.5,\"\"),\"\")","v":""},"",{"$f":"IF(AND(B89<INDIRECT($B$1&\"!$C$7\"),ISNUMBER(B89)),INDIRECT($B$1&\"!$C$16\")*ERFC(0.5*C89*SQRT(INDIRECT($B$1&\"!$F$10\")/(INDIRECT($B$1&\"!$F$9\")*INDIRECT($B$1&\"!$C$20\")*B89))),\"\")","v":""},{"$f":"(INDIRECT($B$1&\"!$F$15\") -D89)/C89","v":{"$error":"#VALUE!"}},{"$f":"IF(ISNUMBER(E89),E89*INDIRECT($B$1&\"!$F$9\")/$G$3,\"\")","v":""},"",{"$f":"IF(B89<INDIRECT($B$1&\"!$C$7\"),H88-G89,\"\")","v":""}]
[null,{"$f":"IF(ISNUMBER(B89),IF(AND(B89<INDIRECT($B$1&\"!$C$7\"),H89>0), B89+0.5,\"\"),\"\")","v":""},"",{"$f":"IF(AND(B90<INDIRECT($B$1&\"!$C$7\"),ISNUMBER(B90)),INDIRECT($B$1&\"!$C$16\")*ERFC(0.5*C90*SQRT(INDIRECT($B$1&\"!$F$10\")/(INDIRECT($B$1&\"!$F$9\")*INDIRECT($B$1&\"!$C$20\")*B90))),\"\")","v":""},{"$f":"(INDIRECT($B$1&\"!$F$15\") -D90)/C90","v":{"$error":"#VALUE!"}},{"$f":"IF(ISNUMBER(E90),E90*INDIRECT($B$1&\"!$F$9\")/$G$3,\"\")","v":""},"",{"$f":"IF(B90<INDIRECT($B$1&\"!$C$7\"),H89-G90,\"\")","v":""}]
[null,{"$f":"IF(ISNUMBER(B90),IF(AND(B90<INDIRECT($B$1&\"!$C$7\"),H90>0), B90+0.5,\"\"),\"\")","v":""},"",{"$f":"IF(AND(B91<INDIRECT($B$1&\"!$C$7\"),ISNUMBER(B91)),INDIRECT($B$1&\"!$C$16\")*ERFC(0.5*C91*SQRT(INDIRECT($B$1&\"!$F$10\")/(INDIRECT($B$1&\"!$F$9\")*INDIRECT($B$1&\"!$C$20\")*B91))),\"\")","v":""},{"$f":"(INDIRECT($B$1&\"!$F$15\") -D91)/C91","v":{"$error":"#VALUE!"}},{"$f":"IF(ISNUMBER(E91),E91*INDIRECT($B$1&\"!$F$9\")/$G$3,\"\")","v":""},"",{"$f":"IF(B91<INDIRECT($B$1&\"!$C$7\"),H90-G91,\"\")","v":""}]
[null,{"$f":"IF(ISNUMBER(B91),IF(AND(B91<INDIRECT($B$1&\"!$C$7\"),H91>0), B91+0.5,\"\"),\"\")","v":""},"",{"$f":"IF(AND(B92<INDIRECT($B$1&\"!$C$7\"),ISNUMBER(B92)),INDIRECT($B$1&\"!$C$16\")*ERFC(0.5*C92*SQRT(INDIRECT($B$1&\"!$F$10\")/(INDIRECT($B$1&\"!$F$9\")*INDIRECT($B$1&\"!$C$20\")*B92))),\"\")","v":""},{"$f":"(INDIRECT($B$1&\"!$F$15\") -D92)/C92","v":{"$error":"#VALUE!"}},{"$f":"IF(ISNUMBER(E92),E92*INDIRECT($B$1&\"!$F$9\")/$G$3,\"\")","v":""},"",{"$f":"IF(B92<INDIRECT($B$1&\"!$C$7\"),H91-G92,\"\")","v":""}]
[null,{"$f":"IF(ISNUMBER(B92),IF(AND(B92<INDIRECT($B$1&\"!$C$7\"),H92>0), B92+0.5,\"\"),\"\")","v":""},"",{"$f":"IF(AND(B93<INDIRECT($B$1&\"!$C$7\"),ISNUMBER(B93)),INDIRECT($B$1&\"!$C$16\")*ERFC(0.5*C93*SQRT(INDIRECT($B$1&\"!$F$10\")/(INDIRECT($B$1&\"!$F$9\")*INDIRECT($B$1&\"!$C$20\")*B93))),\"\")","v":""},{"$f":"(INDIRECT($B$1&\"!$F$15\") -D93)/C93","v":{"$error":"#VALUE!"}},{"$f":"IF(ISNUMBER(E93),E93*INDIRECT($B$1&\"!$F$9\")/$G$3,\"\")","v":""},"",{"$f":"IF(B93<INDIRECT($B$1&\"!$C$7\"),H92-G93,\"\")","v":""}]
[null,{"$f":"IF(ISNUMBER(B93),IF(AND(B93<INDIRECT($B$1&\"!$C$7\"),H93>0), B93+0.5,\"\"),\"\")","v":""},"",{"$f":"IF(AND(B94<INDIRECT($B$1&\"!$C$7\"),ISNUMBER(B94)),INDIRECT($B$1&\"!$C$16\")*ERFC(0.5*C94*SQRT(INDIRECT($B$1&\"!$F$10\")/(INDIRECT($B$1&\"!$F$9\")*INDIRECT($B$1&\"!$C$20\")*B94))),\"\")","v":""},{"$f":"(INDIRECT($B$1&\"!$F$15\") -D94)/C94","v":{"$error":"#VALUE!"}},{"$f":"IF(ISNUMBER(E94),E94*INDIRECT($B$1&\"!$F$9\")/$G$3,\"\")","v":""},"",{"$f":"IF(B94<INDIRECT($B$1&\"!$C$7\"),H93-G94,\"\")","v":""}]
[null,{"$f":"IF(ISNUMBER(B94),IF(AND(B94<INDIRECT($B$1&\"!$C$7\"),H94>0), B94+0.5,\"\"),\"\")","v":""},"",{"$f":"IF(AND(B95<INDIRECT($B$1&\"!$C$7\"),ISNUMBER(B95)),INDIRECT($B$1&\"!$C$16\")*ERFC(0.5*C95*SQRT(INDIRECT($B$1&\"!$F$10\")/(INDIRECT($B$1&\"!$F$9\")*INDIRECT($B$1&\"!$C$20\")*B95))),\"\")","v":""},{"$f":"(INDIRECT($B$1&\"!$F$15\") -D95)/C95","v":{"$error":"#VALUE!"}},{"$f":"IF(ISNUMBER(E95),E95*INDIRECT($B$1&\"!$F$9\")/$G$3,\"\")","v":""},"",{"$f":"IF(B95<INDIRECT($B$1&\"!$C$7\"),H94-G95,\"\")","v":""}]
[null,{"$f":"IF(ISNUMBER(B95),IF(AND(B95<INDIRECT($B$1&\"!$C$7\"),H95>0), B95+0.5,\"\"),\"\")","v":""},"",{"$f":"IF(AND(B96<INDIRECT($B$1&\"!$C$7\"),ISNUMBER(B96)),INDIRECT($B$1&\"!$C$16\")*ERFC(0.5*C96*SQRT(INDIRECT($B$1&\"!$F$10\")/(INDIRECT($B$1&\"!$F$9\")*INDIRECT($B$1&\"!$C$20\")*B96))),\"\")","v":""},{"$f":"(INDIRECT($B$1&\"!$F$15\") -D96)/C96","v":{"$error":"#VALUE!"}},{"$f":"IF(ISNUMBER(E96),E96*INDIRECT($B$1&\"!$F$9\")/$G$3,\"\")","v":""},"",{"$f":"IF(B96<INDIRECT($B$1&\"!$C$7\"),H95-G96,\"\")","v":""}]
[null,{"$f":"IF(ISNUMBER(B96),IF(AND(B96<INDIRECT($B$1&\"!$C$7\"),H96>0), B96+0.5,\"\"),\"\")","v":""},"",{"$f":"IF(AND(B97<INDIRECT($B$1&\"!$C$7\"),ISNUMBER(B97)),INDIRECT($B$1&\"!$C$16\")*ERFC(0.5*C97*SQRT(INDIRECT($B$1&\"!$F$10\")/(INDIRECT($B$1&\"!$F$9\")*INDIRECT($B$1&\"!$C$20\")*B97))),\"\")","v":""},{"$f":"(INDIRECT($B$1&\"!$F$15\") -D97)/C97","v":{"$error":"#VALUE!"}},{"$f":"IF(ISNUMBER(E97),E97*INDIRECT($B$1&\"!$F$9\")/$G$3,\"\")","v":""},"",{"$f":"IF(B97<INDIRECT($B$1&\"!$C$7\"),H96-G97,\"\")","v":""}]
[null,{"$f":"IF(ISNUMBER(B97),IF(AND(B97<INDIRECT($B$1&\"!$C$7\"),H97>0), B97+0.5,\"\"),\"\")","v":""},"",{"$f":"IF(AND(B98<INDIRECT($B$1&\"!$C$7\"),ISNUMBER(B98)),INDIRECT($B$1&\"!$C$16\")*ERFC(0.5*C98*SQRT(INDIRECT($B$1&\"!$F$10\")/(INDIRECT($B$1&\"!$F$9\")*INDIRECT($B$1&\"!$C$20\")*B98))),\"\")","v":""},{"$f":"(INDIRECT($B$1&\"!$F$15\") -D98)/C98","v":{"$error":"#VALUE!"}},{"$f":"IF(ISNUMBER(E98),E98*INDIRECT($B$1&\"!$F$9\")/$G$3,\"\")","v":""},"",{"$f":"IF(B98<INDIRECT($B$1&\"!$C$7\"),H97-G98,\"\")","v":""}]
[null,{"$f":"IF(ISNUMBER(B98),IF(AND(B98<INDIRECT($B$1&\"!$C$7\"),H98>0), B98+0.5,\"\"),\"\")","v":""},"",{"$f":"IF(AND(B99<INDIRECT($B$1&\"!$C$7\"),ISNUMBER(B99)),INDIRECT($B$1&\"!$C$16\")*ERFC(0.5*C99*SQRT(INDIRECT($B$1&\"!$F$10\")/(INDIRECT($B$1&\"!$F$9\")*INDIRECT($B$1&\"!$C$20\")*B99))),\"\")","v":""},{"$f":"(INDIRECT($B$1&\"!$F$15\") -D99)/C99","v":{"$error":"#VALUE!"}},{"$f":"IF(ISNUMBER(E99),E99*INDIRECT($B$1&\"!$F$9\")/$G$3,\"\")","v":""},"",{"$f":"IF(B99<INDIRECT($B$1&\"!$C$7\"),H98-G99,\"\")","v":""}]
[null,{"$f":"IF(ISNUMBER(B99),IF(AND(B99<INDIRECT($B$1&\"!$C$7\"),H99>0), B99+0.5,\"\"),\"\")","v":""},"",{"$f":"IF(AND(B100<INDIRECT($B$1&\"!$C$7\"),ISNUMBER(B100)),INDIRECT($B$1&\"!$C$16\")*ERFC(0.5*C100*SQRT(INDIRECT($B$1&\"!$F$10\")/(INDIRECT($B$1&\"!$F$9\")*INDIRECT($B$1&\"!$C$20\")*B100))),\"\")","v":""},{"$f":"(INDIRECT($B$1&\"!$F$15\") -D100)/C100","v":{"$error":"#VALUE!"}},{"$f":"IF(ISNUMBER(E100),E100*INDIRECT($B$1&\"!$F$9\")/$G$3,\"\")","v":""},"",{"$f":"IF(B100<INDIRECT($B$1&\"!$C$7\"),H99-G100,\"\")","v":""}]
[null,{"$f":"IF(ISNUMBER(B100),IF(AND(B100<INDIRECT($B$1&\"!$C$7\"),H100>0), B100+0.5,\"\"),\"\")","v":""},"",{"$f":"IF(AND(B101<INDIRECT($B$1&\"!$C$7\"),ISNUMBER(B101)),INDIRECT($B$1&\"!$C$16\")*ERFC(0.5*C101*SQRT(INDIRECT($B$1&\"!$F$10\")/(INDIRECT($B$1&\"!$F$9\")*INDIRECT($B$1&\"!$C$20\")*B101))),\"\")","v":""},{"$f":"(INDIRECT($B$1&\"!$F$15\") -D101)/C101","v":{"$error":"#VALUE!"}},{"$f":"IF(ISNUMBER(E101),E101*INDIRECT($B$1&\"!$F$9\")/$G$3,\"\")","v":""},"",{"$f":"IF(B101<INDIRECT($B$1&\"!$C$7\"),H100-G101,\"\")","v":""}]
[null,{"$f":"IF(ISNUMBER(B101),IF(AND(B101<INDIRECT($B$1&\"!$C$7\"),H101>0), B101+0.5,\"\"),\"\")","v":""},"",{"$f":"IF(AND(B102<INDIRECT($B$1&\"!$C$7\"),ISNUMBER(B102)),INDIRECT($B$1&\"!$C$16\")*ERFC(0.5*C102*SQRT(INDIRECT($B$1&\"!$F$10\")/(INDIRECT($B$1&\"!$F$9\")*INDIRECT($B$1&\"!$C$20\")*B102))),\"\")","v":""},{"$f":"(INDIRECT($B$1&\"!$F$15\") -D102)/C102","v":{"$error":"#VALUE!"}},{"$f":"IF(ISNUMBER(E102),E102*INDIRECT($B$1&\"!$F$9\")/$G$3,\"\")","v":""},"",{"$f":"IF(B102<INDIRECT($B$1&\"!$C$7\"),H101-G102,\"\")","v":""}]
[null,{"$f":"IF(ISNUMBER(B102),IF(AND(B102<INDIRECT($B$1&\"!$C$7\"),H102>0), B102+0.5,\"\"),\"\")","v":""},"",{"$f":"IF(AND(B103<INDIRECT($B$1&\"!$C$7\"),ISNUMBER(B103)),INDIRECT($B$1&\"!$C$16\")*ERFC(0.5*C103*SQRT(INDIRECT($B$1&\"!$F$10\")/(INDIRECT($B$1&\"!$F$9\")*INDIRECT($B$1&\"!$C$20\")*B103))),\"\")","v":""},{"$f":"(INDIRECT($B$1&\"!$F$15\") -D103)/C103","v":{"$error":"#VALUE!"}},{"$f":"IF(ISNUMBER(E103),E103*INDIRECT($B$1&\"!$F$9\")/$G$3,\"\")","v":""},"",{"$f":"IF(B103<INDIRECT($B$1&\"!$C$7\"),H102-G103,\"\")","v":""}]
[null,{"$f":"IF(ISNUMBER(B103),IF(AND(B103<INDIRECT($B$1&\"!$C$7\"),H103>0), B103+0.5,\"\"),\"\")","v":""},"",{"$f":"IF(AND(B104<INDIRECT($B$1&\"!$C$7\"),ISNUMBER(B104)),INDIRECT($B$1&\"!$C$16\")*ERFC(0.5*C104*SQRT(INDIRECT($B$1&\"!$F$10\")/(INDIRECT($B$1&\"!$F$9\")*INDIRECT($B$1&\"!$C$20\")*B104))),\"\")","v":""},{"$f":"(INDIRECT($B$1&\"!$F$15\") -D104)/C104","v":{"$error":"#VALUE!"}},{"$f":"IF(ISNUMBER(E104),E104*INDIRECT($B$1&\"!$F$9\")/$G$3,\"\")","v":""},"",{"$f":"IF(B104<INDIRECT($B$1&\"!$C$7\"),H103-G104,\"\")","v":""}]
[null,{"$f":"IF(ISNUMBER(B104),IF(AND(B104<INDIRECT($B$1&\"!$C$7\"),H104>0), B104+0.5,\"\"),\"\")","v":""},"",{"$f":"IF(AND(B105<INDIRECT($B$1&\"!$C$7\"),ISNUMBER(B105)),INDIRECT($B$1&\"!$C$16\")*ERFC(0.5*C105*SQRT(INDIRECT($B$1&\"!$F$10\")/(INDIRECT($B$1&\"!$F$9\")*INDIRECT($B$1&\"!$C$20\")*B105))),\"\")","v":""},{"$f":"(INDIRECT($B$1&\"!$F$15\") -D105)/C105","v":{"$error":"#VALUE!"}},{"$f":"IF(ISNUMBER(E105),E105*INDIRECT($B$1&\"!$F$9\")/$G$3,\"\")","v":""},"",{"$f":"IF(B105<INDIRECT($B$1&\"!$C$7\"),H104-G105,\"\")","v":""}]
[null,{"$f":"IF(ISNUMBER(B105),IF(AND(B105<INDIRECT($B$1&\"!$C$7\"),H105>0), B105+0.5,\"\"),\"\")","v":""},"",{"$f":"IF(AND(B106<INDIRECT($B$1&\"!$C$7\"),ISNUMBER(B106)),INDIRECT($B$1&\"!$C$16\")*ERFC(0.5*C106*SQRT(INDIRECT($B$1&\"!$F$10\")/(INDIRECT($B$1&\"!$F$9\")*INDIRECT($B$1&\"!$C$20\")*B106))),\"\")","v":""},{"$f":"(INDIRECT($B$1&\"!$F$15\") -D106)/C106","v":{"$error":"#VALUE!"}},{"$f":"IF(ISNUMBER(E106),E106*INDIRECT($B$1&\"!$F$9\")/$G$3,\"\")","v":""},"",{"$f":"IF(B106<INDIRECT($B$1&\"!$C$7\"),H105-G106,\"\")","v":""}]
[null,{"$f":"IF(ISNUMBER(B106),IF(AND(B106<INDIRECT($B$1&\"!$C$7\"),H106>0), B106+0.5,\"\"),\"\")","v":""},"",{"$f":"IF(AND(B107<INDIRECT($B$1&\"!$C$7\"),ISNUMBER(B107)),INDIRECT($B$1&\"!$C$16\")*ERFC(0.5*C107*SQRT(INDIRECT($B$1&\"!$F$10\")/(INDIRECT($B$1&\"!$F$9\")*INDIRECT($B$1&\"!$C$20\")*B107))),\"\")","v":""},{"$f":"(INDIRECT($B$1&\"!$F$15\") -D107)/C107","v":{"$error":"#VALUE!"}},{"$f":"IF(ISNUMBER(E107),E107*INDIRECT($B$1&\"!$F$9\")/$G$3,\"\")","v":""},"",{"$f":"IF(B107<INDIRECT($B$1&\"!$C$7\"),H106-G107,\"\")","v":""}]
[null,{"$f":"IF(ISNUMBER(B107),IF(AND(B107<INDIRECT($B$1&\"!$C$7\"),H107>0), B107+0.5,\"\"),\"\")","v":""},"",{"$f":"IF(AND(B108<INDIRECT($B$1&\"!$C$7\"),ISNUMBER(B108)),INDIRECT($B$1&\"!$C$16\")*ERFC(0.5*C108*SQRT(INDIRECT($B$1&\"!$F$10\")/(INDIRECT($B$1&\"!$F$9\")*INDIRECT($B$1&\"!$C$20\")*B108))),\"\")","v":""},{"$f":"(INDIRECT($B$1&\"!$F$15\") -D108)/C108","v":{"$error":"#VALUE!"}},{"$f":"IF(ISNUMBER(E108),E108*INDIRECT($B$1&\"!$F$9\")/$G$3,\"\")","v":""},"",{"$f":"IF(B108<INDIRECT($B$1&\"!$C$7\"),H107-G108,\"\")","v":""}]
[null,{"$f":"IF(ISNUMBER(B108),IF(AND(B108<INDIRECT($B$1&\"!$C$7\"),H108>0), B108+0.5,\"\"),\"\")","v":""},"",{"$f":"IF(AND(B109<INDIRECT($B$1&\"!$C$7\"),ISNUMBER(B109)),INDIRECT($B$1&\"!$C$16\")*ERFC(0.5*C109*SQRT(INDIRECT($B$1&\"!$F$10\")/(INDIRECT($B$1&\"!$F$9\")*INDIRECT($B$1&\"!$C$20\")*B109))),\"\")","v":""},{"$f":"(INDIRECT($B$1&\"!$F$15\") -D109)/C109","v":{"$error":"#VALUE!"}},{"$f":"IF(ISNUMBER(E109),E109*INDIRECT($B$1&\"!$F$9\")/$G$3,\"\")","v":""},"",{"$f":"IF(B109<INDIRECT($B$1&\"!$C$7\"),H108-G109,\"\")","v":""}]
[null,{"$f":"IF(ISNUMBER(B109),IF(AND(B109<INDIRECT($B$1&\"!$C$7\"),H109>0), B109+0.5,\"\"),\"\")","v":""},"",{"$f":"IF(AND(B110<INDIRECT($B$1&\"!$C$7\"),ISNUMBER(B110)),INDIRECT($B$1&\"!$C$16\")*ERFC(0.5*C110*SQRT(INDIRECT($B$1&\"!$F$10\")/(INDIRECT($B$1&\"!$F$9\")*INDIRECT($B$1&\"!$C$20\")*B110))),\"\")","v":""},{"$f":"(INDIRECT($B$1&\"!$F$15\") -D110)/C110","v":{"$error":"#VALUE!"}},{"$f":"IF(ISNUMBER(E110),E110*INDIRECT($B$1&\"!$F$9\")/$G$3,\"\")","v":""},"",{"$f":"IF(B110<INDIRECT($B$1&\"!$C$7\"),H109-G110,\"\")","v":""}]
[null,{"$f":"IF(ISNUMBER(B110),IF(AND(B110<INDIRECT($B$1&\"!$C$7\"),H110>0), B110+0.5,\"\"),\"\")","v":""},"",{"$f":"IF(AND(B111<INDIRECT($B$1&\"!$C$7\"),ISNUMBER(B111)),INDIRECT($B$1&\"!$C$16\")*ERFC(0.5*C111*SQRT(INDIRECT($B$1&\"!$F$10\")/(INDIRECT($B$1&\"!$F$9\")*INDIRECT($B$1&\"!$C$20\")*B111))),\"\")","v":""},{"$f":"(INDIRECT($B$1&\"!$F$15\") -D111)/C111","v":{"$error":"#VALUE!"}},{"$f":"IF(ISNUMBER(E111),E111*INDIRECT($B$1&\"!$F$9\")/$G$3,\"\")","v":""},"",{"$f":"IF(B111<INDIRECT($B$1&\"!$C$7\"),H110-G111,\"\")","v":""}]
[null,{"$f":"IF(ISNUMBER(B111),IF(AND(B111<INDIRECT($B$1&\"!$C$7\"),H111>0), B111+0.5,\"\"),\"\")","v":""},"",{"$f":"IF(AND(B112<INDIRECT($B$1&\"!$C$7\"),ISNUMBER(B112)),INDIRECT($B$1&\"!$C$16\")*ERFC(0.5*C112*SQRT(INDIRECT($B$1&\"!$F$10\")/(INDIRECT($B$1&\"!$F$9\")*INDIRECT($B$1&\"!$C$20\")*B112))),\"\")","v":""},{"$f":"(INDIRECT($B$1&\"!$F$15\") -D112)/C112","v":{"$error":"#VALUE!"}},{"$f":"IF(ISNUMBER(E112),E112*INDIRECT($B$1&\"!$F$9\")/$G$3,\"\")","v":""},"",{"$f":"IF(B112<INDIRECT($B$1&\"!$C$7\"),H111-G112,\"\")","v":""}]
[null,{"$f":"IF(ISNUMBER(B112),IF(AND(B112<INDIRECT($B$1&\"!$C$7\"),H112>0), B112+0.5,\"\"),\"\")","v":""},{"$f":"IF(ISNUMBER(B113),H112,\"\")","v":""},{"$f":"IF(AND(B113<INDIRECT($B$1&\"!$C$7\"),ISNUMBER(B113)),INDIRECT($B$1&\"!$C$16\")*ERFC(0.5*C113*SQRT(INDIRECT($B$1&\"!$F$10\")/(INDIRECT($B$1&\"!$F$9\")*INDIRECT($B$1&\"!$C$20\")*B113))),\"\")","v":""},{"$f":"(INDIRECT($B$1&\"!$F$15\") -D113)/C113","v":{"$error":"#VALUE!"}},{"$f":"IF(ISNUMBER(E113),E113*INDIRECT($B$1&\"!$F$9\")/$G$3,\"\")","v":""},{"$f":"IF(ISNUMBER(F113),F113*ABS(B112-B113)/$I$3,\"\")","v":""},{"$f":"IF(B113<INDIRECT($B$1&\"!$C$7\"),H112-G113,\"\")","v":""}]
[null,{"$f":"IF(ISNUMBER(B113),IF(AND(B113<INDIRECT($B$1&\"!$C$7\"),H113>0), B113+0.5,\"\"),\"\")","v":""},"",{"$f":"IF(AND(B114<INDIRECT($B$1&\"!$C$7\"),ISNUMBER(B114)),INDIRECT($B$1&\"!$C$16\")*ERFC(0.5*C114*SQRT(INDIRECT($B$1&\"!$F$10\")/(INDIRECT($B$1&\"!$F$9\")*INDIRECT($B$1&\"!$C$20\")*B114))),\"\")","v":""},{"$f":"(INDIRECT($B$1&\"!$F$15\") -D114)/C114","v":{"$error":"#VALUE!"}},{"$f":"IF(ISNUMBER(E114),E114*INDIRECT($B$1&\"!$F$9\")/$G$3,\"\")","v":""},"",{"$f":"IF(B114<INDIRECT($B$1&\"!$C$7\"),H113-G114,\"\")","v":""}]
[null,{"$f":"IF(ISNUMBER(B114),IF(AND(B114<INDIRECT($B$1&\"!$C$7\"),H114>0), B114+0.5,\"\"),\"\")","v":""},"",{"$f":"IF(AND(B115<INDIRECT($B$1&\"!$C$7\"),ISNUMBER(B115)),INDIRECT($B$1&\"!$C$16\")*ERFC(0.5*C115*SQRT(INDIRECT($B$1&\"!$F$10\")/(INDIRECT($B$1&\"!$F$9\")*INDIRECT($B$1&\"!$C$20\")*B115))),\"\")","v":""},{"$f":"(INDIRECT($B$1&\"!$F$15\") -D115)/C115","v":{"$error":"#VALUE!"}},{"$f":"IF(ISNUMBER(E115),E115*INDIRECT($B$1&\"!$F$9\")/$G$3,\"\")","v":""},"",{"$f":"IF(B115<INDIRECT($B$1&\"!$C$7\"),H114-G115,\"\")","v":""}]
[null,{"$f":"IF(ISNUMBER(B115),IF(AND(B115<INDIRECT($B$1&\"!$C$7\"),H115>0), B115+0.5,\"\"),\"\")","v":""},"",{"$f":"IF(AND(B116<INDIRECT($B$1&\"!$C$7\"),ISNUMBER(B116)),INDIRECT($B$1&\"!$C$16\")*ERFC(0.5*C116*SQRT(INDIRECT($B$1&\"!$F$10\")/(INDIRECT($B$1&\"!$F$9\")*INDIRECT($B$1&\"!$C$20\")*B116))),\"\")","v":""},{"$f":"(INDIRECT($B$1&\"!$F$15\") -D116)/C116","v":{"$error":"#VALUE!"}},{"$f":"IF(ISNUMBER(E116),E116*INDIRECT($B$1&\"!$F$9\")/$G$3,\"\")","v":""},"",{"$f":"IF(B116<INDIRECT($B$1&\"!$C$7\"),H115-G116,\"\")","v":""}]
[null,{"$f":"IF(ISNUMBER(B116),IF(AND(B116<INDIRECT($B$1&\"!$C$7\"),H116>0), B116+0.5,\"\"),\"\")","v":""},"",{"$f":"IF(AND(B117<INDIRECT($B$1&\"!$C$7\"),ISNUMBER(B117)),INDIRECT($B$1&\"!$C$16\")*ERFC(0.5*C117*SQRT(INDIRECT($B$1&\"!$F$10\")/(INDIRECT($B$1&\"!$F$9\")*INDIRECT($B$1&\"!$C$20\")*B117))),\"\")","v":""},{"$f":"(INDIRECT($B$1&\"!$F$15\") -D117)/C117","v":{"$error":"#VALUE!"}},{"$f":"IF(ISNUMBER(E117),E117*INDIRECT($B$1&\"!$F$9\")/$G$3,\"\")","v":""},"",{"$f":"IF(B117<INDIRECT($B$1&\"!$C$7\"),H116-G117,\"\")","v":""}]
[null,{"$f":"IF(ISNUMBER(B117),IF(AND(B117<INDIRECT($B$1&\"!$C$7\"),H117>0), B117+0.5,\"\"),\"\")","v":""},"",{"$f":"IF(AND(B118<INDIRECT($B$1&\"!$C$7\"),ISNUMBER(B118)),INDIRECT($B$1&\"!$C$16\")*ERFC(0.5*C118*SQRT(INDIRECT($B$1&\"!$F$10\")/(INDIRECT($B$1&\"!$F$9\")*INDIRECT($B$1&\"!$C$20\")*B118))),\"\")","v":""},{"$f":"(INDIRECT($B$1&\"!$F$15\") -D118)/C118","v":{"$error":"#VALUE!"}},{"$f":"IF(ISNUMBER(E118),E118*INDIRECT($B$1&\"!$F$9\")/$G$3,\"\")","v":""},"",{"$f":"IF(B118<INDIRECT($B$1&\"!$C$7\"),H117-G118,\"\")","v":""}]
[null,{"$f":"IF(ISNUMBER(B118),IF(AND(B118<INDIRECT($B$1&\"!$C$7\"),H118>0), B118+0.5,\"\"),\"\")","v":""},"",{"$f":"IF(AND(B119<INDIRECT($B$1&\"!$C$7\"),ISNUMBER(B119)),INDIRECT($B$1&\"!$C$16\")*ERFC(0.5*C119*SQRT(INDIRECT($B$1&\"!$F$10\")/(INDIRECT($B$1&\"!$F$9\")*INDIRECT($B$1&\"!$C$20\")*B119))),\"\")","v":""},{"$f":"(INDIRECT($B$1&\"!$F$15\") -D119)/C119","v":{"$error":"#VALUE!"}},{"$f":"IF(ISNUMBER(E119),E119*INDIRECT($B$1&\"!$F$9\")/$G$3,\"\")","v":""},"",{"$f":"IF(B119<INDIRECT($B$1&\"!$C$7\"),H118-G119,\"\")","v":""}]
[null,{"$f":"IF(ISNUMBER(B119),IF(AND(B119<INDIRECT($B$1&\"!$C$7\"),H119>0), B119+0.5,\"\"),\"\")","v":""},"",{"$f":"IF(AND(B120<INDIRECT($B$1&\"!$C$7\"),ISNUMBER(B120)),INDIRECT($B$1&\"!$C$16\")*ERFC(0.5*C120*SQRT(INDIRECT($B$1&\"!$F$10\")/(INDIRECT($B$1&\"!$F$9\")*INDIRECT($B$1&\"!$C$20\")*B120))),\"\")","v":""},{"$f":"(INDIRECT($B$1&\"!$F$15\") -D120)/C120","v":{"$error":"#VALUE!"}},{"$f":"IF(ISNUMBER(E120),E120*INDIRECT($B$1&\"!$F$9\")/$G$3,\"\")","v":""},"",{"$f":"IF(B120<INDIRECT($B$1&\"!$C$7\"),H119-G120,\"\")","v":""}]
[null,{"$f":"IF(ISNUMBER(B120),IF(AND(B120<INDIRECT($B$1&\"!$C$7\"),H120>0), B120+0.5,\"\"),\"\")","v":""},"",{"$f":"IF(AND(B121<INDIRECT($B$1&\"!$C$7\"),ISNUMBER(B121)),INDIRECT($B$1&\"!$C$16\")*ERFC(0.5*C121*SQRT(INDIRECT($B$1&\"!$F$10\")/(INDIRECT($B$1&\"!$F$9\")*INDIRECT($B$1&\"!$C$20\")*B121))),\"\")","v":""},{"$f":"(INDIRECT($B$1&\"!$F$15\") -D121)/C121","v":{"$error":"#VALUE!"}},{"$f":"IF(ISNUMBER(E121),E121*INDIRECT($B$1&\"!$F$9\")/$G$3,\"\")","v":""},"",{"$f":"IF(B121<INDIRECT($B$1&\"!$C$7\"),H120-G121,\"\")","v":""}]
[null,{"$f":"IF(ISNUMBER(B121),IF(AND(B121<INDIRECT($B$1&\"!$C$7\"),H121>0), B121+0.5,\"\"),\"\")","v":""},"",{"$f":"IF(AND(B122<INDIRECT($B$1&\"!$C$7\"),ISNUMBER(B122)),INDIRECT($B$1&\"!$C$16\")*ERFC(0.5*C122*SQRT(INDIRECT($B$1&\"!$F$10\")/(INDIRECT($B$1&\"!$F$9\")*INDIRECT($B$1&\"!$C$20\")*B122))),\"\")","v":""},{"$f":"(INDIRECT($B$1&\"!$F$15\") -D122)/C122","v":{"$error":"#VALUE!"}},{"$f":"IF(ISNUMBER(E122),E122*INDIRECT($B$1&\"!$F$9\")/$G$3,\"\")","v":""},"",{"$f":"IF(B122<INDIRECT($B$1&\"!$C$7\"),H121-G122,\"\")","v":""}]
[null,{"$f":"IF(ISNUMBER(B122),IF(AND(B122<INDIRECT($B$1&\"!$C$7\"),H122>0), B122+0.5,\"\"),\"\")","v":""},"",{"$f":"IF(AND(B123<INDIRECT($B$1&\"!$C$7\"),ISNUMBER(B123)),INDIRECT($B$1&\"!$C$16\")*ERFC(0.5*C123*SQRT(INDIRECT($B$1&\"!$F$10\")/(INDIRECT($B$1&\"!$F$9\")*INDIRECT($B$1&\"!$C$20\")*B123))),\"\")","v":""},{"$f":"(INDIRECT($B$1&\"!$F$15\") -D123)/C123","v":{"$error":"#VALUE!"}},{"$f":"IF(ISNUMBER(E123),E123*INDIRECT($B$1&\"!$F$9\")/$G$3,\"\")","v":""},"",{"$f":"IF(B123<INDIRECT($B$1&\"!$C$7\"),H122-G123,\"\")","v":""}]
[null,{"$f":"IF(ISNUMBER(B123),IF(AND(B123<INDIRECT($B$1&\"!$C$7\"),H123>0), B123+0.5,\"\"),\"\")","v":""},"",{"$f":"IF(AND(B124<INDIRECT($B$1&\"!$C$7\"),ISNUMBER(B124)),INDIRECT($B$1&\"!$C$16\")*ERFC(0.5*C124*SQRT(INDIRECT($B$1&\"!$F$10\")/(INDIRECT($B$1&\"!$F$9\")*INDIRECT($B$1&\"!$C$20\")*B124))),\"\")","v":""},{"$f":"(INDIRECT($B$1&\"!$F$15\") -D124)/C124","v":{"$error":"#VALUE!"}},{"$f":"IF(ISNUMBER(E124),E124*INDIRECT($B$1&\"!$F$9\")/$G$3,\"\")","v":""},"",{"$f":"IF(B124<INDIRECT($B$1&\"!$C$7\"),H123-G124,\"\")","v":""}]
[null,{"$f":"IF(ISNUMBER(B124),IF(AND(B124<INDIRECT($B$1&\"!$C$7\"),H124>0), B124+0.5,\"\"),\"\")","v":""},"",{"$f":"IF(AND(B125<INDIRECT($B$1&\"!$C$7\"),ISNUMBER(B125)),INDIRECT($B$1&\"!$C$16\")*ERFC(0.5*C125*SQRT(INDIRECT($B$1&\"!$F$10\")/(INDIRECT($B$1&\"!$F$9\")*INDIRECT($B$1&\"!$C$20\")*B125))),\"\")","v":""},{"$f":"(INDIRECT($B$1&\"!$F$15\") -D125)/C125","v":{"$error":"#VALUE!"}},{"$f":"IF(ISNUMBER(E125),E125*INDIRECT($B$1&\"!$F$9\")/$G$3,\"\")","v":""},"",{"$f":"IF(B125<INDIRECT($B$1&\"!$C$7\"),H124-G125,\"\")","v":""}]
[null,{"$f":"IF(ISNUMBER(B125),IF(AND(B125<INDIRECT($B$1&\"!$C$7\"),H125>0), B125+0.5,\"\"),\"\")","v":""},"",{"$f":"IF(AND(B126<INDIRECT($B$1&\"!$C$7\"),ISNUMBER(B126)),INDIRECT($B$1&\"!$C$16\")*ERFC(0.5*C126*SQRT(INDIRECT($B$1&\"!$F$10\")/(INDIRECT($B$1&\"!$F$9\")*INDIRECT($B$1&\"!$C$20\")*B126))),\"\")","v":""},{"$f":"(INDIRECT($B$1&\"!$F$15\") -D126)/C126","v":{"$error":"#VALUE!"}},{"$f":"IF(ISNUMBER(E126),E126*INDIRECT($B$1&\"!$F$9\")/$G$3,\"\")","v":""},"",{"$f":"IF(B126<INDIRECT($B$1&\"!$C$7\"),H125-G126,\"\")","v":""}]
[null,{"$f":"IF(ISNUMBER(B126),IF(AND(B126<INDIRECT($B$1&\"!$C$7\"),H126>0), B126+0.5,\"\"),\"\")","v":""},"",{"$f":"IF(AND(B127<INDIRECT($B$1&\"!$C$7\"),ISNUMBER(B127)),INDIRECT($B$1&\"!$C$16\")*ERFC(0.5*C127*SQRT(INDIRECT($B$1&\"!$F$10\")/(INDIRECT($B$1&\"!$F$9\")*INDIRECT($B$1&\"!$C$20\")*B127))),\"\")","v":""},{"$f":"(INDIRECT($B$1&\"!$F$15\") -D127)/C127","v":{"$error":"#VALUE!"}},{"$f":"IF(ISNUMBER(E127),E127*INDIRECT($B$1&\"!$F$9\")/$G$3,\"\")","v":""},"",{"$f":"IF(B127<INDIRECT($B$1&\"!$C$7\"),H126-G127,\"\")","v":""}]
[null,{"$f":"IF(ISNUMBER(B127),IF(AND(B127<INDIRECT($B$1&\"!$C$7\"),H127>0), B127+0.5,\"\"),\"\")","v":""},"",{"$f":"IF(AND(B128<INDIRECT($B$1&\"!$C$7\"),ISNUMBER(B128)),INDIRECT($B$1&\"!$C$16\")*ERFC(0.5*C128*SQRT(INDIRECT($B$1&\"!$F$10\")/(INDIRECT($B$1&\"!$F$9\")*INDIRECT($B$1&\"!$C$20\")*B128))),\"\")","v":""},{"$f":"(INDIRECT($B$1&\"!$F$15\") -D128)/C128","v":{"$error":"#VALUE!"}},{"$f":"IF(ISNUMBER(E128),E128*INDIRECT($B$1&\"!$F$9\")/$G$3,\"\")","v":""},"",{"$f":"IF(B128<INDIRECT($B$1&\"!$C$7\"),H127-G128,\"\")","v":""}]
[null,{"$f":"IF(ISNUMBER(B128),IF(AND(B128<INDIRECT($B$1&\"!$C$7\"),H128>0), B128+0.5,\"\"),\"\")","v":""},"",{"$f":"IF(AND(B129<INDIRECT($B$1&\"!$C$7\"),ISNUMBER(B129)),INDIRECT($B$1&\"!$C$16\")*ERFC(0.5*C129*SQRT(INDIRECT($B$1&\"!$F$10\")/(INDIRECT($B$1&\"!$F$9\")*INDIRECT($B$1&\"!$C$20\")*B129))),\"\")","v":""},{"$f":"(INDIRECT($B$1&\"!$F$15\") -D129)/C129","v":{"$error":"#VALUE!"}},{"$f":"IF(ISNUMBER(E129),E129*INDIRECT($B$1&\"!$F$9\")/$G$3,\"\")","v":""},"",{"$f":"IF(B129<INDIRECT($B$1&\"!$C$7\"),H128-G129,\"\")","v":""}]
[null,{"$f":"IF(ISNUMBER(B129),IF(AND(B129<INDIRECT($B$1&\"!$C$7\"),H129>0), B129+0.5,\"\"),\"\")","v":""},"",{"$f":"IF(AND(B130<INDIRECT($B$1&\"!$C$7\"),ISNUMBER(B130)),INDIRECT($B$1&\"!$C$16\")*ERFC(0.5*C130*SQRT(INDIRECT($B$1&\"!$F$10\")/(INDIRECT($B$1&\"!$F$9\")*INDIRECT($B$1&\"!$C$20\")*B130))),\"\")","v":""},{"$f":"(INDIRECT($B$1&\"!$F$15\") -D130)/C130","v":{"$error":"#VALUE!"}},{"$f":"IF(ISNUMBER(E130),E130*INDIRECT($B$1&\"!$F$9\")/$G$3,\"\")","v":""},"",{"$f":"IF(B130<INDIRECT($B$1&\"!$C$7\"),H129-G130,\"\")","v":""}]
[null,{"$f":"IF(ISNUMBER(B130),IF(AND(B130<INDIRECT($B$1&\"!$C$7\"),H130>0), B130+0.5,\"\"),\"\")","v":""},"",{"$f":"IF(AND(B131<INDIRECT($B$1&\"!$C$7\"),ISNUMBER(B131)),INDIRECT($B$1&\"!$C$16\")*ERFC(0.5*C131*SQRT(INDIRECT($B$1&\"!$F$10\")/(INDIRECT($B$1&\"!$F$9\")*INDIRECT($B$1&\"!$C$20\")*B131))),\"\")","v":""},{"$f":"(INDIRECT($B$1&\"!$F$15\") -D131)/C131","v":{"$error":"#VALUE!"}},{"$f":"IF(ISNUMBER(E131),E131*INDIRECT($B$1&\"!$F$9\")/$G$3,\"\")","v":""},"",{"$f":"IF(B131<INDIRECT($B$1&\"!$C$7\"),H130-G131,\"\")","v":""}]
[null,{"$f":"IF(ISNUMBER(B131),IF(AND(B131<INDIRECT($B$1&\"!$C$7\"),H131>0), B131+0.5,\"\"),\"\")","v":""},"",{"$f":"IF(AND(B132<INDIRECT($B$1&\"!$C$7\"),ISNUMBER(B132)),INDIRECT($B$1&\"!$C$16\")*ERFC(0.5*C132*SQRT(INDIRECT($B$1&\"!$F$10\")/(INDIRECT($B$1&\"!$F$9\")*INDIRECT($B$1&\"!$C$20\")*B132))),\"\")","v":""},{"$f":"(INDIRECT($B$1&\"!$F$15\") -D132)/C132","v":{"$error":"#VALUE!"}},{"$f":"IF(ISNUMBER(E132),E132*INDIRECT($B$1&\"!$F$9\")/$G$3,\"\")","v":""},"",{"$f":"IF(B132<INDIRECT($B$1&\"!$C$7\"),H131-G132,\"\")","v":""}]
[null,{"$f":"IF(ISNUMBER(B132),IF(AND(B132<INDIRECT($B$1&\"!$C$7\"),H132>0), B132+0.5,\"\"),\"\")","v":""},"",{"$f":"IF(AND(B133<INDIRECT($B$1&\"!$C$7\"),ISNUMBER(B133)),INDIRECT($B$1&\"!$C$16\")*ERFC(0.5*C133*SQRT(INDIRECT($B$1&\"!$F$10\")/(INDIRECT($B$1&\"!$F$9\")*INDIRECT($B$1&\"!$C$20\")*B133))),\"\")","v":""},{"$f":"(INDIRECT($B$1&\"!$F$15\") -D133)/C133","v":{"$error":"#VALUE!"}},{"$f":"IF(ISNUMBER(E133),E133*INDIRECT($B$1&\"!$F$9\")/$G$3,\"\")","v":""},"",{"$f":"IF(B133<INDIRECT($B$1&\"!$C$7\"),H132-G133,\"\")","v":""}]
[null,{"$f":"IF(ISNUMBER(B133),IF(AND(B133<INDIRECT($B$1&\"!$C$7\"),H133>0), B133+0.5,\"\"),\"\")","v":""},"",{"$f":"IF(AND(B134<INDIRECT($B$1&\"!$C$7\"),ISNUMBER(B134)),INDIRECT($B$1&\"!$C$16\")*ERFC(0.5*C134*SQRT(INDIRECT($B$1&\"!$F$10\")/(INDIRECT($B$1&\"!$F$9\")*INDIRECT($B$1&\"!$C$20\")*B134))),\"\")","v":""},{"$f":"(INDIRECT($B$1&\"!$F$15\") -D134)/C134","v":{"$error":"#VALUE!"}},{"$f":"IF(ISNUMBER(E134),E134*INDIRECT($B$1&\"!$F$9\")/$G$3,\"\")","v":""},"",{"$f":"IF(B134<INDIRECT($B$1&\"!$C$7\"),H133-G134,\"\")","v":""}]
[null,{"$f":"IF(ISNUMBER(B134),IF(AND(B134<INDIRECT($B$1&\"!$C$7\"),H134>0), B134+0.5,\"\"),\"\")","v":""},"",{"$f":"IF(AND(B135<INDIRECT($B$1&\"!$C$7\"),ISNUMBER(B135)),INDIRECT($B$1&\"!$C$16\")*ERFC(0.5*C135*SQRT(INDIRECT($B$1&\"!$F$10\")/(INDIRECT($B$1&\"!$F$9\")*INDIRECT($B$1&\"!$C$20\")*B135))),\"\")","v":""},{"$f":"(INDIRECT($B$1&\"!$F$15\") -D135)/C135","v":{"$error":"#VALUE!"}},{"$f":"IF(ISNUMBER(E135),E135*INDIRECT($B$1&\"!$F$9\")/$G$3,\"\")","v":""},"",{"$f":"IF(B135<INDIRECT($B$1&\"!$C$7\"),H134-G135,\"\")","v":""}]
[null,{"$f":"IF(ISNUMBER(B135),IF(AND(B135<INDIRECT($B$1&\"!$C$7\"),H135>0), B135+0.5,\"\"),\"\")","v":""},"",{"$f":"IF(AND(B136<INDIRECT($B$1&\"!$C$7\"),ISNUMBER(B136)),INDIRECT($B$1&\"!$C$16\")*ERFC(0.5*C136*SQRT(INDIRECT($B$1&\"!$F$10\")/(INDIRECT($B$1&\"!$F$9\")*INDIRECT($B$1&\"!$C$20\")*B136))),\"\")","v":""},{"$f":"(INDIRECT($B$1&\"!$F$15\") -D136)/C136","v":{"$error":"#VALUE!"}},{"$f":"IF(ISNUMBER(E136),E136*INDIRECT($B$1&\"!$F$9\")/$G$3,\"\")","v":""},"",{"$f":"IF(B136<INDIRECT($B$1&\"!$C$7\"),H135-G136,\"\")","v":""}]
[null,{"$f":"IF(ISNUMBER(B136),IF(AND(B136<INDIRECT($B$1&\"!$C$7\"),H136>0), B136+0.5,\"\"),\"\")","v":""},"",{"$f":"IF(AND(B137<INDIRECT($B$1&\"!$C$7\"),ISNUMBER(B137)),INDIRECT($B$1&\"!$C$16\")*ERFC(0.5*C137*SQRT(INDIRECT($B$1&\"!$F$10\")/(INDIRECT($B$1&\"!$F$9\")*INDIRECT($B$1&\"!$C$20\")*B137))),\"\")","v":""},{"$f":"(INDIRECT($B$1&\"!$F$15\") -D137)/C137","v":{"$error":"#VALUE!"}},{"$f":"IF(ISNUMBER(E137),E137*INDIRECT($B$1&\"!$F$9\")/$G$3,\"\")","v":""},"",{"$f":"IF(B137<INDIRECT($B$1&\"!$C$7\"),H136-G137,\"\")","v":""}]
[null,{"$f":"IF(ISNUMBER(B137),IF(AND(B137<INDIRECT($B$1&\"!$C$7\"),H137>0), B137+0.5,\"\"),\"\")","v":""},"",{"$f":"IF(AND(B138<INDIRECT($B$1&\"!$C$7\"),ISNUMBER(B138)),INDIRECT($B$1&\"!$C$16\")*ERFC(0.5*C138*SQRT(INDIRECT($B$1&\"!$F$10\")/(INDIRECT($B$1&\"!$F$9\")*INDIRECT($B$1&\"!$C$20\")*B138))),\"\")","v":""},{"$f":"(INDIRECT($B$1&\"!$F$15\") -D138)/C138","v":{"$error":"#VALUE!"}},{"$f":"IF(ISNUMBER(E138),E138*INDIRECT($B$1&\"!$F$9\")/$G$3,\"\")","v":""},"",{"$f":"IF(B138<INDIRECT($B$1&\"!$C$7\"),H137-G138,\"\")","v":""}]
[null,{"$f":"IF(ISNUMBER(B138),IF(AND(B138<INDIRECT($B$1&\"!$C$7\"),H138>0), B138+0.5,\"\"),\"\")","v":""},"",{"$f":"IF(AND(B139<INDIRECT($B$1&\"!$C$7\"),ISNUMBER(B139)),INDIRECT($B$1&\"!$C$16\")*ERFC(0.5*C139*SQRT(INDIRECT($B$1&\"!$F$10\")/(INDIRECT($B$1&\"!$F$9\")*INDIRECT($B$1&\"!$C$20\")*B139))),\"\")","v":""},{"$f":"(INDIRECT($B$1&\"!$F$15\") -D139)/C139","v":{"$error":"#VALUE!"}},{"$f":"IF(ISNUMBER(E139),E139*INDIRECT($B$1&\"!$F$9\")/$G$3,\"\")","v":""},"",{"$f":"IF(B139<INDIRECT($B$1&\"!$C$7\"),H138-G139,\"\")","v":""}]
[null,{"$f":"IF(ISNUMBER(B139),IF(AND(B139<INDIRECT($B$1&\"!$C$7\"),H139>0), B139+0.5,\"\"),\"\")","v":""},"",{"$f":"IF(AND(B140<INDIRECT($B$1&\"!$C$7\"),ISNUMBER(B140)),INDIRECT($B$1&\"!$C$16\")*ERFC(0.5*C140*SQRT(INDIRECT($B$1&\"!$F$10\")/(INDIRECT($B$1&\"!$F$9\")*INDIRECT($B$1&\"!$C$20\")*B140))),\"\")","v":""},{"$f":"(INDIRECT($B$1&\"!$F$15\") -D140)/C140","v":{"$error":"#VALUE!"}},{"$f":"IF(ISNUMBER(E140),E140*INDIRECT($B$1&\"!$F$9\")/$G$3,\"\")","v":""},"",{"$f":"IF(B140<INDIRECT($B$1&\"!$C$7\"),H139-G140,\"\")","v":""}]
[null,{"$f":"IF(ISNUMBER(B140),IF(AND(B140<INDIRECT($B$1&\"!$C$7\"),H140>0), B140+0.5,\"\"),\"\")","v":""},"",{"$f":"IF(AND(B141<INDIRECT($B$1&\"!$C$7\"),ISNUMBER(B141)),INDIRECT($B$1&\"!$C$16\")*ERFC(0.5*C141*SQRT(INDIRECT($B$1&\"!$F$10\")/(INDIRECT($B$1&\"!$F$9\")*INDIRECT($B$1&\"!$C$20\")*B141))),\"\")","v":""},{"$f":"(INDIRECT($B$1&\"!$F$15\") -D141)/C141","v":{"$error":"#VALUE!"}},{"$f":"IF(ISNUMBER(E141),E141*INDIRECT($B$1&\"!$F$9\")/$G$3,\"\")","v":""},"",{"$f":"IF(B141<INDIRECT($B$1&\"!$C$7\"),H140-G141,\"\")","v":""}]
[null,{"$f":"IF(ISNUMBER(B141),IF(AND(B141<INDIRECT($B$1&\"!$C$7\"),H141>0), B141+0.5,\"\"),\"\")","v":""},"",{"$f":"IF(AND(B142<INDIRECT($B$1&\"!$C$7\"),ISNUMBER(B142)),INDIRECT($B$1&\"!$C$16\")*ERFC(0.5*C142*SQRT(INDIRECT($B$1&\"!$F$10\")/(INDIRECT($B$1&\"!$F$9\")*INDIRECT($B$1&\"!$C$20\")*B142))),\"\")","v":""},{"$f":"(INDIRECT($B$1&\"!$F$15\") -D142)/C142","v":{"$error":"#VALUE!"}},{"$f":"IF(ISNUMBER(E142),E142*INDIRECT($B$1&\"!$F$9\")/$G$3,\"\")","v":""},"",{"$f":"IF(B142<INDIRECT($B$1&\"!$C$7\"),H141-G142,\"\")","v":""}]
[null,{"$f":"IF(ISNUMBER(B142),IF(AND(B142<INDIRECT($B$1&\"!$C$7\"),H142>0), B142+0.5,\"\"),\"\")","v":""},"",{"$f":"IF(AND(B143<INDIRECT($B$1&\"!$C$7\"),ISNUMBER(B143)),INDIRECT($B$1&\"!$C$16\")*ERFC(0.5*C143*SQRT(INDIRECT($B$1&\"!$F$10\")/(INDIRECT($B$1&\"!$F$9\")*INDIRECT($B$1&\"!$C$20\")*B143))),\"\")","v":""},{"$f":"(INDIRECT($B$1&\"!$F$15\") -D143)/C143","v":{"$error":"#VALUE!"}},{"$f":"IF(ISNUMBER(E143),E143*INDIRECT($B$1&\"!$F$9\")/$G$3,\"\")","v":""},"",{"$f":"IF(B143<INDIRECT($B$1&\"!$C$7\"),H142-G143,\"\")","v":""}]
[null,{"$f":"IF(ISNUMBER(B143),IF(AND(B143<INDIRECT($B$1&\"!$C$7\"),H143>0), B143+0.5,\"\"),\"\")","v":""},"",{"$f":"IF(AND(B144<INDIRECT($B$1&\"!$C$7\"),ISNUMBER(B144)),INDIRECT($B$1&\"!$C$16\")*ERFC(0.5*C144*SQRT(INDIRECT($B$1&\"!$F$10\")/(INDIRECT($B$1&\"!$F$9\")*INDIRECT($B$1&\"!$C$20\")*B144))),\"\")","v":""},{"$f":"(INDIRECT($B$1&\"!$F$15\") -D144)/C144","v":{"$error":"#VALUE!"}},{"$f":"IF(ISNUMBER(E144),E144*INDIRECT($B$1&\"!$F$9\")/$G$3,\"\")","v":""},"",{"$f":"IF(B144<INDIRECT($B$1&\"!$C$7\"),H143-G144,\"\")","v":""}]
[null,{"$f":"IF(ISNUMBER(B144),IF(AND(B144<INDIRECT($B$1&\"!$C$7\"),H144>0), B144+0.5,\"\"),\"\")","v":""},"",{"$f":"IF(AND(B145<INDIRECT($B$1&\"!$C$7\"),ISNUMBER(B145)),INDIRECT($B$1&\"!$C$16\")*ERFC(0.5*C145*SQRT(INDIRECT($B$1&\"!$F$10\")/(INDIRECT($B$1&\"!$F$9\")*INDIRECT($B$1&\"!$C$20\")*B145))),\"\")","v":""},{"$f":"(INDIRECT($B$1&\"!$F$15\") -D145)/C145","v":{"$error":"#VALUE!"}},{"$f":"IF(ISNUMBER(E145),E145*INDIRECT($B$1&\"!$F$9\")/$G$3,\"\")","v":""},"",{"$f":"IF(B145<INDIRECT($B$1&\"!$C$7\"),H144-G145,\"\")","v":""}]
[null,{"$f":"IF(ISNUMBER(B145),IF(AND(B145<INDIRECT($B$1&\"!$C$7\"),H145>0), B145+0.5,\"\"),\"\")","v":""},"",{"$f":"IF(AND(B146<INDIRECT($B$1&\"!$C$7\"),ISNUMBER(B146)),INDIRECT($B$1&\"!$C$16\")*ERFC(0.5*C146*SQRT(INDIRECT($B$1&\"!$F$10\")/(INDIRECT($B$1&\"!$F$9\")*INDIRECT($B$1&\"!$C$20\")*B146))),\"\")","v":""},{"$f":"(INDIRECT($B$1&\"!$F$15\") -D146)/C146","v":{"$error":"#VALUE!"}},{"$f":"IF(ISNUMBER(E146),E146*INDIRECT($B$1&\"!$F$9\")/$G$3,\"\")","v":""},"",{"$f":"IF(B146<INDIRECT($B$1&\"!$C$7\"),H145-G146,\"\")","v":""}]
[null,{"$f":"IF(ISNUMBER(B146),IF(AND(B146<INDIRECT($B$1&\"!$C$7\"),H146>0), B146+0.5,\"\"),\"\")","v":""},"",{"$f":"IF(AND(B147<INDIRECT($B$1&\"!$C$7\"),ISNUMBER(B147)),INDIRECT($B$1&\"!$C$16\")*ERFC(0.5*C147*SQRT(INDIRECT($B$1&\"!$F$10\")/(INDIRECT($B$1&\"!$F$9\")*INDIRECT($B$1&\"!$C$20\")*B147))),\"\")","v":""},{"$f":"(INDIRECT($B$1&\"!$F$15\") -D147)/C147","v":{"$error":"#VALUE!"}},{"$f":"IF(ISNUMBER(E147),E147*INDIRECT($B$1&\"!$F$9\")/$G$3,\"\")","v":""},"",{"$f":"IF(B147<INDIRECT($B$1&\"!$C$7\"),H146-G147,\"\")","v":""}]
[null,{"$f":"IF(ISNUMBER(B147),IF(AND(B147<INDIRECT($B$1&\"!$C$7\"),H147>0), B147+0.5,\"\"),\"\")","v":""},"",{"$f":"IF(AND(B148<INDIRECT($B$1&\"!$C$7\"),ISNUMBER(B148)),INDIRECT($B$1&\"!$C$16\")*ERFC(0.5*C148*SQRT(INDIRECT($B$1&\"!$F$10\")/(INDIRECT($B$1&\"!$F$9\")*INDIRECT($B$1&\"!$C$20\")*B148))),\"\")","v":""},{"$f":"(INDIRECT($B$1&\"!$F$15\") -D148)/C148","v":{"$error":"#VALUE!"}},{"$f":"IF(ISNUMBER(E148),E148*INDIRECT($B$1&\"!$F$9\")/$G$3,\"\")","v":""},"",{"$f":"IF(B148<INDIRECT($B$1&\"!$C$7\"),H147-G148,\"\")","v":""}]
[null,{"$f":"IF(ISNUMBER(B148),IF(AND(B148<INDIRECT($B$1&\"!$C$7\"),H148>0), B148+0.5,\"\"),\"\")","v":""},"",{"$f":"IF(AND(B149<INDIRECT($B$1&\"!$C$7\"),ISNUMBER(B149)),INDIRECT($B$1&\"!$C$16\")*ERFC(0.5*C149*SQRT(INDIRECT($B$1&\"!$F$10\")/(INDIRECT($B$1&\"!$F$9\")*INDIRECT($B$1&\"!$C$20\")*B149))),\"\")","v":""},{"$f":"(INDIRECT($B$1&\"!$F$15\") -D149)/C149","v":{"$error":"#VALUE!"}},{"$f":"IF(ISNUMBER(E149),E149*INDIRECT($B$1&\"!$F$9\")/$G$3,\"\")","v":""},"",{"$f":"IF(B149<INDIRECT($B$1&\"!$C$7\"),H148-G149,\"\")","v":""}]
[null,{"$f":"IF(ISNUMBER(B149),IF(AND(B149<INDIRECT($B$1&\"!$C$7\"),H149>0), B149+0.5,\"\"),\"\")","v":""},"",{"$f":"IF(AND(B150<INDIRECT($B$1&\"!$C$7\"),ISNUMBER(B150)),INDIRECT($B$1&\"!$C$16\")*ERFC(0.5*C150*SQRT(INDIRECT($B$1&\"!$F$10\")/(INDIRECT($B$1&\"!$F$9\")*INDIRECT($B$1&\"!$C$20\")*B150))),\"\")","v":""},{"$f":"(INDIRECT($B$1&\"!$F$15\") -D150)/C150","v":{"$error":"#VALUE!"}},{"$f":"IF(ISNUMBER(E150),E150*INDIRECT($B$1&\"!$F$9\")/$G$3,\"\")","v":""},"",{"$f":"IF(B150<INDIRECT($B$1&\"!$C$7\"),H149-G150,\"\")","v":""}]
[null,{"$f":"IF(ISNUMBER(B150),IF(AND(B150<INDIRECT($B$1&\"!$C$7\"),H150>0), B150+0.5,\"\"),\"\")","v":""},"",{"$f":"IF(AND(B151<INDIRECT($B$1&\"!$C$7\"),ISNUMBER(B151)),INDIRECT($B$1&\"!$C$16\")*ERFC(0.5*C151*SQRT(INDIRECT($B$1&\"!$F$10\")/(INDIRECT($B$1&\"!$F$9\")*INDIRECT($B$1&\"!$C$20\")*B151))),\"\")","v":""},{"$f":"(INDIRECT($B$1&\"!$F$15\") -D151)/C151","v":{"$error":"#VALUE!"}},{"$f":"IF(ISNUMBER(E151),E151*INDIRECT($B$1&\"!$F$9\")/$G$3,\"\")","v":""},"",{"$f":"IF(B151<INDIRECT($B$1&\"!$C$7\"),H150-G151,\"\")","v":""}]
[null,{"$f":"IF(ISNUMBER(B151),IF(AND(B151<INDIRECT($B$1&\"!$C$7\"),H151>0), B151+0.5,\"\"),\"\")","v":""},"",{"$f":"IF(AND(B152<INDIRECT($B$1&\"!$C$7\"),ISNUMBER(B152)),INDIRECT($B$1&\"!$C$16\")*ERFC(0.5*C152*SQRT(INDIRECT($B$1&\"!$F$10\")/(INDIRECT($B$1&\"!$F$9\")*INDIRECT($B$1&\"!$C$20\")*B152))),\"\")","v":""},{"$f":"(INDIRECT($B$1&\"!$F$15\") -D152)/C152","v":{"$error":"#VALUE!"}},{"$f":"IF(ISNUMBER(E152),E152*INDIRECT($B$1&\"!$F$9\")/$G$3,\"\")","v":""},"",{"$f":"IF(B152<INDIRECT($B$1&\"!$C$7\"),H151-G152,\"\")","v":""}]
[null,{"$f":"IF(ISNUMBER(B152),IF(AND(B152<INDIRECT($B$1&\"!$C$7\"),H152>0), B152+0.5,\"\"),\"\")","v":""},"",{"$f":"IF(AND(B153<INDIRECT($B$1&\"!$C$7\"),ISNUMBER(B153)),INDIRECT($B$1&\"!$C$16\")*ERFC(0.5*C153*SQRT(INDIRECT($B$1&\"!$F$10\")/(INDIRECT($B$1&\"!$F$9\")*INDIRECT($B$1&\"!$C$20\")*B153))),\"\")","v":""},{"$f":"(INDIRECT($B$1&\"!$F$15\") -D153)/C153","v":{"$error":"#VALUE!"}},{"$f":"IF(ISNUMBER(E153),E153*INDIRECT($B$1&\"!$F$9\")/$G$3,\"\")","v":""},"",{"$f":"IF(B153<INDIRECT($B$1&\"!$C$7\"),H152-G153,\"\")","v":""}]
[null,{"$f":"IF(ISNUMBER(B153),IF(AND(B153<INDIRECT($B$1&\"!$C$7\"),H153>0), B153+0.5,\"\"),\"\")","v":""},"",{"$f":"IF(AND(B154<INDIRECT($B$1&\"!$C$7\"),ISNUMBER(B154)),INDIRECT($B$1&\"!$C$16\")*ERFC(0.5*C154*SQRT(INDIRECT($B$1&\"!$F$10\")/(INDIRECT($B$1&\"!$F$9\")*INDIRECT($B$1&\"!$C$20\")*B154))),\"\")","v":""},{"$f":"(INDIRECT($B$1&\"!$F$15\") -D154)/C154","v":{"$error":"#VALUE!"}},{"$f":"IF(ISNUMBER(E154),E154*INDIRECT($B$1&\"!$F$9\")/$G$3,\"\")","v":""},"",{"$f":"IF(B154<INDIRECT($B$1&\"!$C$7\"),H153-G154,\"\")","v":""}]
[null,{"$f":"IF(ISNUMBER(B154),IF(AND(B154<INDIRECT($B$1&\"!$C$7\"),H154>0), B154+0.5,\"\"),\"\")","v":""},"",{"$f":"IF(AND(B155<INDIRECT($B$1&\"!$C$7\"),ISNUMBER(B155)),INDIRECT($B$1&\"!$C$16\")*ERFC(0.5*C155*SQRT(INDIRECT($B$1&\"!$F$10\")/(INDIRECT($B$1&\"!$F$9\")*INDIRECT($B$1&\"!$C$20\")*B155))),\"\")","v":""},{"$f":"(INDIRECT($B$1&\"!$F$15\") -D155)/C155","v":{"$error":"#VALUE!"}},{"$f":"IF(ISNUMBER(E155),E155*INDIRECT($B$1&\"!$F$9\")/$G$3,\"\")","v":""},"",{"$f":"IF(B155<INDIRECT($B$1&\"!$C$7\"),H154-G155,\"\")","v":""}]
[null,{"$f":"IF(ISNUMBER(B155),IF(AND(B155<INDIRECT($B$1&\"!$C$7\"),H155>0), B155+0.5,\"\"),\"\")","v":""},"",{"$f":"IF(AND(B156<INDIRECT($B$1&\"!$C$7\"),ISNUMBER(B156)),INDIRECT($B$1&\"!$C$16\")*ERFC(0.5*C156*SQRT(INDIRECT($B$1&\"!$F$10\")/(INDIRECT($B$1&\"!$F$9\")*INDIRECT($B$1&\"!$C$20\")*B156))),\"\")","v":""},{"$f":"(INDIRECT($B$1&\"!$F$15\") -D156)/C156","v":{"$error":"#VALUE!"}},{"$f":"IF(ISNUMBER(E156),E156*INDIRECT($B$1&\"!$F$9\")/$G$3,\"\")","v":""},"",{"$f":"IF(B156<INDIRECT($B$1&\"!$C$7\"),H155-G156,\"\")","v":""}]
[null,{"$f":"IF(ISNUMBER(B156),IF(AND(B156<INDIRECT($B$1&\"!$C$7\"),H156>0), B156+0.5,\"\"),\"\")","v":""},"",{"$f":"IF(AND(B157<INDIRECT($B$1&\"!$C$7\"),ISNUMBER(B157)),INDIRECT($B$1&\"!$C$16\")*ERFC(0.5*C157*SQRT(INDIRECT($B$1&\"!$F$10\")/(INDIRECT($B$1&\"!$F$9\")*INDIRECT($B$1&\"!$C$20\")*B157))),\"\")","v":""},{"$f":"(INDIRECT($B$1&\"!$F$15\") -D157)/C157","v":{"$error":"#VALUE!"}},{"$f":"IF(ISNUMBER(E157),E157*INDIRECT($B$1&\"!$F$9\")/$G$3,\"\")","v":""},"",{"$f":"IF(B157<INDIRECT($B$1&\"!$C$7\"),H156-G157,\"\")","v":""}]
[null,{"$f":"IF(ISNUMBER(B157),IF(AND(B157<INDIRECT($B$1&\"!$C$7\"),H157>0), B157+0.5,\"\"),\"\")","v":""},"",{"$f":"IF(AND(B158<INDIRECT($B$1&\"!$C$7\"),ISNUMBER(B158)),INDIRECT($B$1&\"!$C$16\")*ERFC(0.5*C158*SQRT(INDIRECT($B$1&\"!$F$10\")/(INDIRECT($B$1&\"!$F$9\")*INDIRECT($B$1&\"!$C$20\")*B158))),\"\")","v":""},{"$f":"(INDIRECT($B$1&\"!$F$15\") -D158)/C158","v":{"$error":"#VALUE!"}},{"$f":"IF(ISNUMBER(E158),E158*INDIRECT($B$1&\"!$F$9\")/$G$3,\"\")","v":""},"",{"$f":"IF(B158<INDIRECT($B$1&\"!$C$7\"),H157-G158,\"\")","v":""}]
[null,{"$f":"IF(ISNUMBER(B158),IF(AND(B158<INDIRECT($B$1&\"!$C$7\"),H158>0), B158+0.5,\"\"),\"\")","v":""},"",{"$f":"IF(AND(B159<INDIRECT($B$1&\"!$C$7\"),ISNUMBER(B159)),INDIRECT($B$1&\"!$C$16\")*ERFC(0.5*C159*SQRT(INDIRECT($B$1&\"!$F$10\")/(INDIRECT($B$1&\"!$F$9\")*INDIRECT($B$1&\"!$C$20\")*B159))),\"\")","v":""},{"$f":"(INDIRECT($B$1&\"!$F$15\") -D159)/C159","v":{"$error":"#VALUE!"}},{"$f":"IF(ISNUMBER(E159),E159*INDIRECT($B$1&\"!$F$9\")/$G$3,\"\")","v":""},"",{"$f":"IF(B159<INDIRECT($B$1&\"!$C$7\"),H158-G159,\"\")","v":""}]
[null,{"$f":"IF(ISNUMBER(B159),IF(AND(B159<INDIRECT($B$1&\"!$C$7\"),H159>0), B159+0.5,\"\"),\"\")","v":""},"",{"$f":"IF(AND(B160<INDIRECT($B$1&\"!$C$7\"),ISNUMBER(B160)),INDIRECT($B$1&\"!$C$16\")*ERFC(0.5*C160*SQRT(INDIRECT($B$1&\"!$F$10\")/(INDIRECT($B$1&\"!$F$9\")*INDIRECT($B$1&\"!$C$20\")*B160))),\"\")","v":""},{"$f":"(INDIRECT($B$1&\"!$F$15\") -D160)/C160","v":{"$error":"#VALUE!"}},{"$f":"IF(ISNUMBER(E160),E160*INDIRECT($B$1&\"!$F$9\")/$G$3,\"\")","v":""},"",{"$f":"IF(B160<INDIRECT($B$1&\"!$C$7\"),H159-G160,\"\")","v":""}]
[null,{"$f":"IF(ISNUMBER(B160),IF(AND(B160<INDIRECT($B$1&\"!$C$7\"),H160>0), B160+0.5,\"\"),\"\")","v":""},"",{"$f":"IF(AND(B161<INDIRECT($B$1&\"!$C$7\"),ISNUMBER(B161)),INDIRECT($B$1&\"!$C$16\")*ERFC(0.5*C161*SQRT(INDIRECT($B$1&\"!$F$10\")/(INDIRECT($B$1&\"!$F$9\")*INDIRECT($B$1&\"!$C$20\")*B161))),\"\")","v":""},{"$f":"(INDIRECT($B$1&\"!$F$15\") -D161)/C161","v":{"$error":"#VALUE!"}},{"$f":"IF(ISNUMBER(E161),E161*INDIRECT($B$1&\"!$F$9\")/$G$3,\"\")","v":""},"",{"$f":"IF(B161<INDIRECT($B$1&\"!$C$7\"),H160-G161,\"\")","v":""}]
[null,{"$f":"IF(ISNUMBER(B161),IF(AND(B161<INDIRECT($B$1&\"!$C$7\"),H161>0), B161+0.5,\"\"),\"\")","v":""},"",{"$f":"IF(AND(B162<INDIRECT($B$1&\"!$C$7\"),ISNUMBER(B162)),INDIRECT($B$1&\"!$C$16\")*ERFC(0.5*C162*SQRT(INDIRECT($B$1&\"!$F$10\")/(INDIRECT($B$1&\"!$F$9\")*INDIRECT($B$1&\"!$C$20\")*B162))),\"\")","v":""},{"$f":"(INDIRECT($B$1&\"!$F$15\") -D162)/C162","v":{"$error":"#VALUE!"}},{"$f":"IF(ISNUMBER(E162),E162*INDIRECT($B$1&\"!$F$9\")/$G$3,\"\")","v":""},"",{"$f":"IF(B162<INDIRECT($B$1&\"!$C$7\"),H161-G162,\"\")","v":""}]
[null,{"$f":"IF(ISNUMBER(B162),IF(AND(B162<INDIRECT($B$1&\"!$C$7\"),H162>0), B162+0.5,\"\"),\"\")","v":""},"",{"$f":"IF(AND(B163<INDIRECT($B$1&\"!$C$7\"),ISNUMBER(B163)),INDIRECT($B$1&\"!$C$16\")*ERFC(0.5*C163*SQRT(INDIRECT($B$1&\"!$F$10\")/(INDIRECT($B$1&\"!$F$9\")*INDIRECT($B$1&\"!$C$20\")*B163))),\"\")","v":""},{"$f":"(INDIRECT($B$1&\"!$F$15\") -D163)/C163","v":{"$error":"#VALUE!"}},{"$f":"IF(ISNUMBER(E163),E163*INDIRECT($B$1&\"!$F$9\")/$G$3,\"\")","v":""},"",{"$f":"IF(B163<INDIRECT($B$1&\"!$C$7\"),H162-G163,\"\")","v":""}]
[null,{"$f":"IF(ISNUMBER(B163),IF(AND(B163<INDIRECT($B$1&\"!$C$7\"),H163>0), B163+0.5,\"\"),\"\")","v":""},"",{"$f":"IF(AND(B164<INDIRECT($B$1&\"!$C$7\"),ISNUMBER(B164)),INDIRECT($B$1&\"!$C$16\")*ERFC(0.5*C164*SQRT(INDIRECT($B$1&\"!$F$10\")/(INDIRECT($B$1&\"!$F$9\")*INDIRECT($B$1&\"!$C$20\")*B164))),\"\")","v":""},{"$f":"(INDIRECT($B$1&\"!$F$15\") -D164)/C164","v":{"$error":"#VALUE!"}},{"$f":"IF(ISNUMBER(E164),E164*INDIRECT($B$1&\"!$F$9\")/$G$3,\"\")","v":""},"",{"$f":"IF(B164<INDIRECT($B$1&\"!$C$7\"),H163-G164,\"\")","v":""}]
[null,{"$f":"IF(ISNUMBER(B164),IF(AND(B164<INDIRECT($B$1&\"!$C$7\"),H164>0), B164+0.5,\"\"),\"\")","v":""},"",{"$f":"IF(AND(B165<INDIRECT($B$1&\"!$C$7\"),ISNUMBER(B165)),INDIRECT($B$1&\"!$C$16\")*ERFC(0.5*C165*SQRT(INDIRECT($B$1&\"!$F$10\")/(INDIRECT($B$1&\"!$F$9\")*INDIRECT($B$1&\"!$C$20\")*B165))),\"\")","v":""},{"$f":"(INDIRECT($B$1&\"!$F$15\") -D165)/C165","v":{"$error":"#VALUE!"}},{"$f":"IF(ISNUMBER(E165),E165*INDIRECT($B$1&\"!$F$9\")/$G$3,\"\")","v":""},"",{"$f":"IF(B165<INDIRECT($B$1&\"!$C$7\"),H164-G165,\"\")","v":""}]
[null,{"$f":"IF(ISNUMBER(B165),IF(AND(B165<INDIRECT($B$1&\"!$C$7\"),H165>0), B165+0.5,\"\"),\"\")","v":""},"",{"$f":"IF(AND(B166<INDIRECT($B$1&\"!$C$7\"),ISNUMBER(B166)),INDIRECT($B$1&\"!$C$16\")*ERFC(0.5*C166*SQRT(INDIRECT($B$1&\"!$F$10\")/(INDIRECT($B$1&\"!$F$9\")*INDIRECT($B$1&\"!$C$20\")*B166))),\"\")","v":""},{"$f":"(INDIRECT($B$1&\"!$F$15\") -D166)/C166","v":{"$error":"#VALUE!"}},{"$f":"IF(ISNUMBER(E166),E166*INDIRECT($B$1&\"!$F$9\")/$G$3,\"\")","v":""},"",{"$f":"IF(B166<INDIRECT($B$1&\"!$C$7\"),H165-G166,\"\")","v":""}]
[null,{"$f":"IF(ISNUMBER(B166),IF(AND(B166<INDIRECT($B$1&\"!$C$7\"),H166>0), B166+0.5,\"\"),\"\")","v":""},"",{"$f":"IF(AND(B167<INDIRECT($B$1&\"!$C$7\"),ISNUMBER(B167)),INDIRECT($B$1&\"!$C$16\")*ERFC(0.5*C167*SQRT(INDIRECT($B$1&\"!$F$10\")/(INDIRECT($B$1&\"!$F$9\")*INDIRECT($B$1&\"!$C$20\")*B167))),\"\")","v":""},{"$f":"(INDIRECT($B$1&\"!$F$15\") -D167)/C167","v":{"$error":"#VALUE!"}},{"$f":"IF(ISNUMBER(E167),E167*INDIRECT($B$1&\"!$F$9\")/$G$3,\"\")","v":""},"",{"$f":"IF(B167<INDIRECT($B$1&\"!$C$7\"),H166-G167,\"\")","v":""}]
[null,{"$f":"IF(ISNUMBER(B167),IF(AND(B167<INDIRECT($B$1&\"!$C$7\"),H167>0), B167+0.5,\"\"),\"\")","v":""},"",{"$f":"IF(AND(B168<INDIRECT($B$1&\"!$C$7\"),ISNUMBER(B168)),INDIRECT($B$1&\"!$C$16\")*ERFC(0.5*C168*SQRT(INDIRECT($B$1&\"!$F$10\")/(INDIRECT($B$1&\"!$F$9\")*INDIRECT($B$1&\"!$C$20\")*B168))),\"\")","v":""},{"$f":"(INDIRECT($B$1&\"!$F$15\") -D168)/C168","v":{"$error":"#VALUE!"}},{"$f":"IF(ISNUMBER(E168),E168*INDIRECT($B$1&\"!$F$9\")/$G$3,\"\")","v":""},"",{"$f":"IF(B168<INDIRECT($B$1&\"!$C$7\"),H167-G168,\"\")","v":""}]
[null,{"$f":"IF(ISNUMBER(B168),IF(AND(B168<INDIRECT($B$1&\"!$C$7\"),H168>0), B168+0.5,\"\"),\"\")","v":""},"",{"$f":"IF(AND(B169<INDIRECT($B$1&\"!$C$7\"),ISNUMBER(B169)),INDIRECT($B$1&\"!$C$16\")*ERFC(0.5*C169*SQRT(INDIRECT($B$1&\"!$F$10\")/(INDIRECT($B$1&\"!$F$9\")*INDIRECT($B$1&\"!$C$20\")*B169))),\"\")","v":""},{"$f":"(INDIRECT($B$1&\"!$F$15\") -D169)/C169","v":{"$error":"#VALUE!"}},{"$f":"IF(ISNUMBER(E169),E169*INDIRECT($B$1&\"!$F$9\")/$G$3,\"\")","v":""},"",{"$f":"IF(B169<INDIRECT($B$1&\"!$C$7\"),H168-G169,\"\")","v":""}]
[null,{"$f":"IF(ISNUMBER(B169),IF(AND(B169<INDIRECT($B$1&\"!$C$7\"),H169>0), B169+0.5,\"\"),\"\")","v":""},"",{"$f":"IF(AND(B170<INDIRECT($B$1&\"!$C$7\"),ISNUMBER(B170)),INDIRECT($B$1&\"!$C$16\")*ERFC(0.5*C170*SQRT(INDIRECT($B$1&\"!$F$10\")/(INDIRECT($B$1&\"!$F$9\")*INDIRECT($B$1&\"!$C$20\")*B170))),\"\")","v":""},{"$f":"(INDIRECT($B$1&\"!$F$15\") -D170)/C170","v":{"$error":"#VALUE!"}},{"$f":"IF(ISNUMBER(E170),E170*INDIRECT($B$1&\"!$F$9\")/$G$3,\"\")","v":""},"",{"$f":"IF(B170<INDIRECT($B$1&\"!$C$7\"),H169-G170,\"\")","v":""}]
[null,{"$f":"IF(ISNUMBER(B170),IF(AND(B170<INDIRECT($B$1&\"!$C$7\"),H170>0), B170+0.5,\"\"),\"\")","v":""},"",{"$f":"IF(AND(B171<INDIRECT($B$1&\"!$C$7\"),ISNUMBER(B171)),INDIRECT($B$1&\"!$C$16\")*ERFC(0.5*C171*SQRT(INDIRECT($B$1&\"!$F$10\")/(INDIRECT($B$1&\"!$F$9\")*INDIRECT($B$1&\"!$C$20\")*B171))),\"\")","v":""},{"$f":"(INDIRECT($B$1&\"!$F$15\") -D171)/C171","v":{"$error":"#VALUE!"}},{"$f":"IF(ISNUMBER(E171),E171*INDIRECT($B$1&\"!$F$9\")/$G$3,\"\")","v":""},"",{"$f":"IF(B171<INDIRECT($B$1&\"!$C$7\"),H170-G171,\"\")","v":""}]
[null,{"$f":"IF(ISNUMBER(B171),IF(AND(B171<INDIRECT($B$1&\"!$C$7\"),H171>0), B171+0.5,\"\"),\"\")","v":""},"",{"$f":"IF(AND(B172<INDIRECT($B$1&\"!$C$7\"),ISNUMBER(B172)),INDIRECT($B$1&\"!$C$16\")*ERFC(0.5*C172*SQRT(INDIRECT($B$1&\"!$F$10\")/(INDIRECT($B$1&\"!$F$9\")*INDIRECT($B$1&\"!$C$20\")*B172))),\"\")","v":""},{"$f":"(INDIRECT($B$1&\"!$F$15\") -D172)/C172","v":{"$error":"#VALUE!"}},{"$f":"IF(ISNUMBER(E172),E172*INDIRECT($B$1&\"!$F$9\")/$G$3,\"\")","v":""},"",{"$f":"IF(B172<INDIRECT($B$1&\"!$C$7\"),H171-G172,\"\")","v":""}]
[null,{"$f":"IF(ISNUMBER(B172),IF(AND(B172<INDIRECT($B$1&\"!$C$7\"),H172>0), B172+0.5,\"\"),\"\")","v":""},"",{"$f":"IF(AND(B173<INDIRECT($B$1&\"!$C$7\"),ISNUMBER(B173)),INDIRECT($B$1&\"!$C$16\")*ERFC(0.5*C173*SQRT(INDIRECT($B$1&\"!$F$10\")/(INDIRECT($B$1&\"!$F$9\")*INDIRECT($B$1&\"!$C$20\")*B173))),\"\")","v":""},{"$f":"(INDIRECT($B$1&\"!$F$15\") -D173)/C173","v":{"$error":"#VALUE!"}},{"$f":"IF(ISNUMBER(E173),E173*INDIRECT($B$1&\"!$F$9\")/$G$3,\"\")","v":""},"",{"$f":"IF(B173<INDIRECT($B$1&\"!$C$7\"),H172-G173,\"\")","v":""}]
[null,{"$f":"IF(ISNUMBER(B173),IF(AND(B173<INDIRECT($B$1&\"!$C$7\"),H173>0), B173+0.5,\"\"),\"\")","v":""},"",{"$f":"IF(AND(B174<INDIRECT($B$1&\"!$C$7\"),ISNUMBER(B174)),INDIRECT($B$1&\"!$C$16\")*ERFC(0.5*C174*SQRT(INDIRECT($B$1&\"!$F$10\")/(INDIRECT($B$1&\"!$F$9\")*INDIRECT($B$1&\"!$C$20\")*B174))),\"\")","v":""},{"$f":"(INDIRECT($B$1&\"!$F$15\") -D174)/C174","v":{"$error":"#VALUE!"}},{"$f":"IF(ISNUMBER(E174),E174*INDIRECT($B$1&\"!$F$9\")/$G$3,\"\")","v":""},"",{"$f":"IF(B174<INDIRECT($B$1&\"!$C$7\"),H173-G174,\"\")","v":""}]
[null,{"$f":"IF(ISNUMBER(B174),IF(AND(B174<INDIRECT($B$1&\"!$C$7\"),H174>0), B174+0.5,\"\"),\"\")","v":""},"",{"$f":"IF(AND(B175<INDIRECT($B$1&\"!$C$7\"),ISNUMBER(B175)),INDIRECT($B$1&\"!$C$16\")*ERFC(0.5*C175*SQRT(INDIRECT($B$1&\"!$F$10\")/(INDIRECT($B$1&\"!$F$9\")*INDIRECT($B$1&\"!$C$20\")*B175))),\"\")","v":""},{"$f":"(INDIRECT($B$1&\"!$F$15\") -D175)/C175","v":{"$error":"#VALUE!"}},{"$f":"IF(ISNUMBER(E175),E175*INDIRECT($B$1&\"!$F$9\")/$G$3,\"\")","v":""},"",{"$f":"IF(B175<INDIRECT($B$1&\"!$C$7\"),H174-G175,\"\")","v":""}]
[null,{"$f":"IF(ISNUMBER(B175),IF(AND(B175<INDIRECT($B$1&\"!$C$7\"),H175>0), B175+0.5,\"\"),\"\")","v":""},"",{"$f":"IF(AND(B176<INDIRECT($B$1&\"!$C$7\"),ISNUMBER(B176)),INDIRECT($B$1&\"!$C$16\")*ERFC(0.5*C176*SQRT(INDIRECT($B$1&\"!$F$10\")/(INDIRECT($B$1&\"!$F$9\")*INDIRECT($B$1&\"!$C$20\")*B176))),\"\")","v":""},{"$f":"(INDIRECT($B$1&\"!$F$15\") -D176)/C176","v":{"$error":"#VALUE!"}},{"$f":"IF(ISNUMBER(E176),E176*INDIRECT($B$1&\"!$F$9\")/$G$3,\"\")","v":""},"",{"$f":"IF(B176<INDIRECT($B$1&\"!$C$7\"),H175-G176,\"\")","v":""}]
[null,{"$f":"IF(ISNUMBER(B176),IF(AND(B176<INDIRECT($B$1&\"!$C$7\"),H176>0), B176+0.5,\"\"),\"\")","v":""},{"$f":"IF(ISNUMBER(B177),H176,\"\")","v":""},{"$f":"IF(AND(B177<INDIRECT($B$1&\"!$C$7\"),ISNUMBER(B177)),INDIRECT($B$1&\"!$C$16\")*ERFC(0.5*C177*SQRT(INDIRECT($B$1&\"!$F$10\")/(INDIRECT($B$1&\"!$F$9\")*INDIRECT($B$1&\"!$C$20\")*B177))),\"\")","v":""},{"$f":"(INDIRECT($B$1&\"!$F$15\") -D177)/C177","v":{"$error":"#VALUE!"}},{"$f":"IF(ISNUMBER(E177),E177*INDIRECT($B$1&\"!$F$9\")/$G$3,\"\")","v":""},{"$f":"IF(ISNUMBER(F177),F177*ABS(B176-B177)/$I$3,\"\")","v":""},{"$f":"IF(B177<INDIRECT($B$1&\"!$C$7\"),H176-G177,\"\")","v":""}]
[null,{"$f":"IF(ISNUMBER(B177),IF(AND(B177<INDIRECT($B$1&\"!$C$7\"),H177>0), B177+0.5,\"\"),\"\")","v":""},"",{"$f":"IF(AND(B178<INDIRECT($B$1&\"!$C$7\"),ISNUMBER(B178)),INDIRECT($B$1&\"!$C$16\")*ERFC(0.5*C178*SQRT(INDIRECT($B$1&\"!$F$10\")/(INDIRECT($B$1&\"!$F$9\")*INDIRECT($B$1&\"!$C$20\")*B178))),\"\")","v":""},{"$f":"(INDIRECT($B$1&\"!$F$15\") -D178)/C178","v":{"$error":"#VALUE!"}},{"$f":"IF(ISNUMBER(E178),E178*INDIRECT($B$1&\"!$F$9\")/$G$3,\"\")","v":""},"",{"$f":"IF(B178<INDIRECT($B$1&\"!$C$7\"),H177-G178,\"\")","v":""}]
[null,{"$f":"IF(ISNUMBER(B178),IF(AND(B178<INDIRECT($B$1&\"!$C$7\"),H178>0), B178+0.5,\"\"),\"\")","v":""},"",{"$f":"IF(AND(B179<INDIRECT($B$1&\"!$C$7\"),ISNUMBER(B179)),INDIRECT($B$1&\"!$C$16\")*ERFC(0.5*C179*SQRT(INDIRECT($B$1&\"!$F$10\")/(INDIRECT($B$1&\"!$F$9\")*INDIRECT($B$1&\"!$C$20\")*B179))),\"\")","v":""},{"$f":"(INDIRECT($B$1&\"!$F$15\") -D179)/C179","v":{"$error":"#VALUE!"}},{"$f":"IF(ISNUMBER(E179),E179*INDIRECT($B$1&\"!$F$9\")/$G$3,\"\")","v":""},"",{"$f":"IF(B179<INDIRECT($B$1&\"!$C$7\"),H178-G179,\"\")","v":""}]
[null,{"$f":"IF(ISNUMBER(B179),IF(AND(B179<INDIRECT($B$1&\"!$C$7\"),H179>0), B179+0.5,\"\"),\"\")","v":""},"",{"$f":"IF(AND(B180<INDIRECT($B$1&\"!$C$7\"),ISNUMBER(B180)),INDIRECT($B$1&\"!$C$16\")*ERFC(0.5*C180*SQRT(INDIRECT($B$1&\"!$F$10\")/(INDIRECT($B$1&\"!$F$9\")*INDIRECT($B$1&\"!$C$20\")*B180))),\"\")","v":""},{"$f":"(INDIRECT($B$1&\"!$F$15\") -D180)/C180","v":{"$error":"#VALUE!"}},{"$f":"IF(ISNUMBER(E180),E180*INDIRECT($B$1&\"!$F$9\")/$G$3,\"\")","v":""},"",{"$f":"IF(B180<INDIRECT($B$1&\"!$C$7\"),H179-G180,\"\")","v":""}]
[null,{"$f":"IF(ISNUMBER(B180),IF(AND(B180<INDIRECT($B$1&\"!$C$7\"),H180>0), B180+0.5,\"\"),\"\")","v":""},"",{"$f":"IF(AND(B181<INDIRECT($B$1&\"!$C$7\"),ISNUMBER(B181)),INDIRECT($B$1&\"!$C$16\")*ERFC(0.5*C181*SQRT(INDIRECT($B$1&\"!$F$10\")/(INDIRECT($B$1&\"!$F$9\")*INDIRECT($B$1&\"!$C$20\")*B181))),\"\")","v":""},{"$f":"(INDIRECT($B$1&\"!$F$15\") -D181)/C181","v":{"$error":"#VALUE!"}},{"$f":"IF(ISNUMBER(E181),E181*INDIRECT($B$1&\"!$F$9\")/$G$3,\"\")","v":""},"",{"$f":"IF(B181<INDIRECT($B$1&\"!$C$7\"),H180-G181,\"\")","v":""}]
[null,{"$f":"IF(ISNUMBER(B181),IF(AND(B181<INDIRECT($B$1&\"!$C$7\"),H181>0), B181+0.5,\"\"),\"\")","v":""},"",{"$f":"IF(AND(B182<INDIRECT($B$1&\"!$C$7\"),ISNUMBER(B182)),INDIRECT($B$1&\"!$C$16\")*ERFC(0.5*C182*SQRT(INDIRECT($B$1&\"!$F$10\")/(INDIRECT($B$1&\"!$F$9\")*INDIRECT($B$1&\"!$C$20\")*B182))),\"\")","v":""},{"$f":"(INDIRECT($B$1&\"!$F$15\") -D182)/C182","v":{"$error":"#VALUE!"}},{"$f":"IF(ISNUMBER(E182),E182*INDIRECT($B$1&\"!$F$9\")/$G$3,\"\")","v":""},"",{"$f":"IF(B182<INDIRECT($B$1&\"!$C$7\"),H181-G182,\"\")","v":""}]
[null,{"$f":"IF(ISNUMBER(B182),IF(AND(B182<INDIRECT($B$1&\"!$C$7\"),H182>0), B182+0.5,\"\"),\"\")","v":""},"",{"$f":"IF(AND(B183<INDIRECT($B$1&\"!$C$7\"),ISNUMBER(B183)),INDIRECT($B$1&\"!$C$16\")*ERFC(0.5*C183*SQRT(INDIRECT($B$1&\"!$F$10\")/(INDIRECT($B$1&\"!$F$9\")*INDIRECT($B$1&\"!$C$20\")*B183))),\"\")","v":""},{"$f":"(INDIRECT($B$1&\"!$F$15\") -D183)/C183","v":{"$error":"#VALUE!"}},{"$f":"IF(ISNUMBER(E183),E183*INDIRECT($B$1&\"!$F$9\")/$G$3,\"\")","v":""},"",{"$f":"IF(B183<INDIRECT($B$1&\"!$C$7\"),H182-G183,\"\")","v":""}]
[null,{"$f":"IF(ISNUMBER(B183),IF(AND(B183<INDIRECT($B$1&\"!$C$7\"),H183>0), B183+0.5,\"\"),\"\")","v":""},"",{"$f":"IF(AND(B184<INDIRECT($B$1&\"!$C$7\"),ISNUMBER(B184)),INDIRECT($B$1&\"!$C$16\")*ERFC(0.5*C184*SQRT(INDIRECT($B$1&\"!$F$10\")/(INDIRECT($B$1&\"!$F$9\")*INDIRECT($B$1&\"!$C$20\")*B184))),\"\")","v":""},{"$f":"(INDIRECT($B$1&\"!$F$15\") -D184)/C184","v":{"$error":"#VALUE!"}},{"$f":"IF(ISNUMBER(E184),E184*INDIRECT($B$1&\"!$F$9\")/$G$3,\"\")","v":""},"",{"$f":"IF(B184<INDIRECT($B$1&\"!$C$7\"),H183-G184,\"\")","v":""}]
[null,{"$f":"IF(ISNUMBER(B184),IF(AND(B184<INDIRECT($B$1&\"!$C$7\"),H184>0), B184+0.5,\"\"),\"\")","v":""},"",{"$f":"IF(AND(B185<INDIRECT($B$1&\"!$C$7\"),ISNUMBER(B185)),INDIRECT($B$1&\"!$C$16\")*ERFC(0.5*C185*SQRT(INDIRECT($B$1&\"!$F$10\")/(INDIRECT($B$1&\"!$F$9\")*INDIRECT($B$1&\"!$C$20\")*B185))),\"\")","v":""},{"$f":"(INDIRECT($B$1&\"!$F$15\") -D185)/C185","v":{"$error":"#VALUE!"}},{"$f":"IF(ISNUMBER(E185),E185*INDIRECT($B$1&\"!$F$9\")/$G$3,\"\")","v":""},"",{"$f":"IF(B185<INDIRECT($B$1&\"!$C$7\"),H184-G185,\"\")","v":""}]
[null,{"$f":"IF(ISNUMBER(B185),IF(AND(B185<INDIRECT($B$1&\"!$C$7\"),H185>0), B185+0.5,\"\"),\"\")","v":""},"",{"$f":"IF(AND(B186<INDIRECT($B$1&\"!$C$7\"),ISNUMBER(B186)),INDIRECT($B$1&\"!$C$16\")*ERFC(0.5*C186*SQRT(INDIRECT($B$1&\"!$F$10\")/(INDIRECT($B$1&\"!$F$9\")*INDIRECT($B$1&\"!$C$20\")*B186))),\"\")","v":""},{"$f":"(INDIRECT($B$1&\"!$F$15\") -D186)/C186","v":{"$error":"#VALUE!"}},{"$f":"IF(ISNUMBER(E186),E186*INDIRECT($B$1&\"!$F$9\")/$G$3,\"\")","v":""},"",{"$f":"IF(B186<INDIRECT($B$1&\"!$C$7\"),H185-G186,\"\")","v":""}]
[null,{"$f":"IF(ISNUMBER(B186),IF(AND(B186<INDIRECT($B$1&\"!$C$7\"),H186>0), B186+0.5,\"\"),\"\")","v":""},"",{"$f":"IF(AND(B187<INDIRECT($B$1&\"!$C$7\"),ISNUMBER(B187)),INDIRECT($B$1&\"!$C$16\")*ERFC(0.5*C187*SQRT(INDIRECT($B$1&\"!$F$10\")/(INDIRECT($B$1&\"!$F$9\")*INDIRECT($B$1&\"!$C$20\")*B187))),\"\")","v":""},{"$f":"(INDIRECT($B$1&\"!$F$15\") -D187)/C187","v":{"$error":"#VALUE!"}},{"$f":"IF(ISNUMBER(E187),E187*INDIRECT($B$1&\"!$F$9\")/$G$3,\"\")","v":""},"",{"$f":"IF(B187<INDIRECT($B$1&\"!$C$7\"),H186-G187,\"\")","v":""}]
[null,{"$f":"IF(ISNUMBER(B187),IF(AND(B187<INDIRECT($B$1&\"!$C$7\"),H187>0), B187+0.5,\"\"),\"\")","v":""},"",{"$f":"IF(AND(B188<INDIRECT($B$1&\"!$C$7\"),ISNUMBER(B188)),INDIRECT($B$1&\"!$C$16\")*ERFC(0.5*C188*SQRT(INDIRECT($B$1&\"!$F$10\")/(INDIRECT($B$1&\"!$F$9\")*INDIRECT($B$1&\"!$C$20\")*B188))),\"\")","v":""},{"$f":"(INDIRECT($B$1&\"!$F$15\") -D188)/C188","v":{"$error":"#VALUE!"}},{"$f":"IF(ISNUMBER(E188),E188*INDIRECT($B$1&\"!$F$9\")/$G$3,\"\")","v":""},"",{"$f":"IF(B188<INDIRECT($B$1&\"!$C$7\"),H187-G188,\"\")","v":""}]
[null,{"$f":"IF(ISNUMBER(B188),IF(AND(B188<INDIRECT($B$1&\"!$C$7\"),H188>0), B188+0.5,\"\"),\"\")","v":""},"",{"$f":"IF(AND(B189<INDIRECT($B$1&\"!$C$7\"),ISNUMBER(B189)),INDIRECT($B$1&\"!$C$16\")*ERFC(0.5*C189*SQRT(INDIRECT($B$1&\"!$F$10\")/(INDIRECT($B$1&\"!$F$9\")*INDIRECT($B$1&\"!$C$20\")*B189))),\"\")","v":""},{"$f":"(INDIRECT($B$1&\"!$F$15\") -D189)/C189","v":{"$error":"#VALUE!"}},{"$f":"IF(ISNUMBER(E189),E189*INDIRECT($B$1&\"!$F$9\")/$G$3,\"\")","v":""},"",{"$f":"IF(B189<INDIRECT($B$1&\"!$C$7\"),H188-G189,\"\")","v":""}]
[null,{"$f":"IF(ISNUMBER(B189),IF(AND(B189<INDIRECT($B$1&\"!$C$7\"),H189>0), B189+0.5,\"\"),\"\")","v":""},"",{"$f":"IF(AND(B190<INDIRECT($B$1&\"!$C$7\"),ISNUMBER(B190)),INDIRECT($B$1&\"!$C$16\")*ERFC(0.5*C190*SQRT(INDIRECT($B$1&\"!$F$10\")/(INDIRECT($B$1&\"!$F$9\")*INDIRECT($B$1&\"!$C$20\")*B190))),\"\")","v":""},{"$f":"(INDIRECT($B$1&\"!$F$15\") -D190)/C190","v":{"$error":"#VALUE!"}},{"$f":"IF(ISNUMBER(E190),E190*INDIRECT($B$1&\"!$F$9\")/$G$3,\"\")","v":""},"",{"$f":"IF(B190<INDIRECT($B$1&\"!$C$7\"),H189-G190,\"\")","v":""}]
[null,{"$f":"IF(ISNUMBER(B190),IF(AND(B190<INDIRECT($B$1&\"!$C$7\"),H190>0), B190+0.5,\"\"),\"\")","v":""},"",{"$f":"IF(AND(B191<INDIRECT($B$1&\"!$C$7\"),ISNUMBER(B191)),INDIRECT($B$1&\"!$C$16\")*ERFC(0.5*C191*SQRT(INDIRECT($B$1&\"!$F$10\")/(INDIRECT($B$1&\"!$F$9\")*INDIRECT($B$1&\"!$C$20\")*B191))),\"\")","v":""},{"$f":"(INDIRECT($B$1&\"!$F$15\") -D191)/C191","v":{"$error":"#VALUE!"}},{"$f":"IF(ISNUMBER(E191),E191*INDIRECT($B$1&\"!$F$9\")/$G$3,\"\")","v":""},"",{"$f":"IF(B191<INDIRECT($B$1&\"!$C$7\"),H190-G191,\"\")","v":""}]
[null,{"$f":"IF(ISNUMBER(B191),IF(AND(B191<INDIRECT($B$1&\"!$C$7\"),H191>0), B191+0.5,\"\"),\"\")","v":""},"",{"$f":"IF(AND(B192<INDIRECT($B$1&\"!$C$7\"),ISNUMBER(B192)),INDIRECT($B$1&\"!$C$16\")*ERFC(0.5*C192*SQRT(INDIRECT($B$1&\"!$F$10\")/(INDIRECT($B$1&\"!$F$9\")*INDIRECT($B$1&\"!$C$20\")*B192))),\"\")","v":""},{"$f":"(INDIRECT($B$1&\"!$F$15\") -D192)/C192","v":{"$error":"#VALUE!"}},{"$f":"IF(ISNUMBER(E192),E192*INDIRECT($B$1&\"!$F$9\")/$G$3,\"\")","v":""},"",{"$f":"IF(B192<INDIRECT($B$1&\"!$C$7\"),H191-G192,\"\")","v":""}]
[null,{"$f":"IF(ISNUMBER(B192),IF(AND(B192<INDIRECT($B$1&\"!$C$7\"),H192>0), B192+0.5,\"\"),\"\")","v":""},"",{"$f":"IF(AND(B193<INDIRECT($B$1&\"!$C$7\"),ISNUMBER(B193)),INDIRECT($B$1&\"!$C$16\")*ERFC(0.5*C193*SQRT(INDIRECT($B$1&\"!$F$10\")/(INDIRECT($B$1&\"!$F$9\")*INDIRECT($B$1&\"!$C$20\")*B193))),\"\")","v":""},{"$f":"(INDIRECT($B$1&\"!$F$15\") -D193)/C193","v":{"$error":"#VALUE!"}},{"$f":"IF(ISNUMBER(E193),E193*INDIRECT($B$1&\"!$F$9\")/$G$3,\"\")","v":""},"",{"$f":"IF(B193<INDIRECT($B$1&\"!$C$7\"),H192-G193,\"\")","v":""}]
[null,{"$f":"IF(ISNUMBER(B193),IF(AND(B193<INDIRECT($B$1&\"!$C$7\"),H193>0), B193+0.5,\"\"),\"\")","v":""},"",{"$f":"IF(AND(B194<INDIRECT($B$1&\"!$C$7\"),ISNUMBER(B194)),INDIRECT($B$1&\"!$C$16\")*ERFC(0.5*C194*SQRT(INDIRECT($B$1&\"!$F$10\")/(INDIRECT($B$1&\"!$F$9\")*INDIRECT($B$1&\"!$C$20\")*B194))),\"\")","v":""},{"$f":"(INDIRECT($B$1&\"!$F$15\") -D194)/C194","v":{"$error":"#VALUE!"}},{"$f":"IF(ISNUMBER(E194),E194*INDIRECT($B$1&\"!$F$9\")/$G$3,\"\")","v":""},"",{"$f":"IF(B194<INDIRECT($B$1&\"!$C$7\"),H193-G194,\"\")","v":""}]
[null,{"$f":"IF(ISNUMBER(B194),IF(AND(B194<INDIRECT($B$1&\"!$C$7\"),H194>0), B194+0.5,\"\"),\"\")","v":""},"",{"$f":"IF(AND(B195<INDIRECT($B$1&\"!$C$7\"),ISNUMBER(B195)),INDIRECT($B$1&\"!$C$16\")*ERFC(0.5*C195*SQRT(INDIRECT($B$1&\"!$F$10\")/(INDIRECT($B$1&\"!$F$9\")*INDIRECT($B$1&\"!$C$20\")*B195))),\"\")","v":""},{"$f":"(INDIRECT($B$1&\"!$F$15\") -D195)/C195","v":{"$error":"#VALUE!"}},{"$f":"IF(ISNUMBER(E195),E195*INDIRECT($B$1&\"!$F$9\")/$G$3,\"\")","v":""},"",{"$f":"IF(B195<INDIRECT($B$1&\"!$C$7\"),H194-G195,\"\")","v":""}]
[null,{"$f":"IF(ISNUMBER(B195),IF(AND(B195<INDIRECT($B$1&\"!$C$7\"),H195>0), B195+0.5,\"\"),\"\")","v":""},"",{"$f":"IF(AND(B196<INDIRECT($B$1&\"!$C$7\"),ISNUMBER(B196)),INDIRECT($B$1&\"!$C$16\")*ERFC(0.5*C196*SQRT(INDIRECT($B$1&\"!$F$10\")/(INDIRECT($B$1&\"!$F$9\")*INDIRECT($B$1&\"!$C$20\")*B196))),\"\")","v":""},{"$f":"(INDIRECT($B$1&\"!$F$15\") -D196)/C196","v":{"$error":"#VALUE!"}},{"$f":"IF(ISNUMBER(E196),E196*INDIRECT($B$1&\"!$F$9\")/$G$3,\"\")","v":""},"",{"$f":"IF(B196<INDIRECT($B$1&\"!$C$7\"),H195-G196,\"\")","v":""}]
[null,{"$f":"IF(ISNUMBER(B196),IF(AND(B196<INDIRECT($B$1&\"!$C$7\"),H196>0), B196+0.5,\"\"),\"\")","v":""},"",{"$f":"IF(AND(B197<INDIRECT($B$1&\"!$C$7\"),ISNUMBER(B197)),INDIRECT($B$1&\"!$C$16\")*ERFC(0.5*C197*SQRT(INDIRECT($B$1&\"!$F$10\")/(INDIRECT($B$1&\"!$F$9\")*INDIRECT($B$1&\"!$C$20\")*B197))),\"\")","v":""},{"$f":"(INDIRECT($B$1&\"!$F$15\") -D197)/C197","v":{"$error":"#VALUE!"}},{"$f":"IF(ISNUMBER(E197),E197*INDIRECT($B$1&\"!$F$9\")/$G$3,\"\")","v":""},"",{"$f":"IF(B197<INDIRECT($B$1&\"!$C$7\"),H196-G197,\"\")","v":""}]
[null,{"$f":"IF(ISNUMBER(B197),IF(AND(B197<INDIRECT($B$1&\"!$C$7\"),H197>0), B197+0.5,\"\"),\"\")","v":""},"",{"$f":"IF(AND(B198<INDIRECT($B$1&\"!$C$7\"),ISNUMBER(B198)),INDIRECT($B$1&\"!$C$16\")*ERFC(0.5*C198*SQRT(INDIRECT($B$1&\"!$F$10\")/(INDIRECT($B$1&\"!$F$9\")*INDIRECT($B$1&\"!$C$20\")*B198))),\"\")","v":""},{"$f":"(INDIRECT($B$1&\"!$F$15\") -D198)/C198","v":{"$error":"#VALUE!"}},{"$f":"IF(ISNUMBER(E198),E198*INDIRECT($B$1&\"!$F$9\")/$G$3,\"\")","v":""},"",{"$f":"IF(B198<INDIRECT($B$1&\"!$C$7\"),H197-G198,\"\")","v":""}]
[null,{"$f":"IF(ISNUMBER(B198),IF(AND(B198<INDIRECT($B$1&\"!$C$7\"),H198>0), B198+0.5,\"\"),\"\")","v":""},"",{"$f":"IF(AND(B199<INDIRECT($B$1&\"!$C$7\"),ISNUMBER(B199)),INDIRECT($B$1&\"!$C$16\")*ERFC(0.5*C199*SQRT(INDIRECT($B$1&\"!$F$10\")/(INDIRECT($B$1&\"!$F$9\")*INDIRECT($B$1&\"!$C$20\")*B199))),\"\")","v":""},{"$f":"(INDIRECT($B$1&\"!$F$15\") -D199)/C199","v":{"$error":"#VALUE!"}},{"$f":"IF(ISNUMBER(E199),E199*INDIRECT($B$1&\"!$F$9\")/$G$3,\"\")","v":""},"",{"$f":"IF(B199<INDIRECT($B$1&\"!$C$7\"),H198-G199,\"\")","v":""}]
[null,{"$f":"IF(ISNUMBER(B199),IF(AND(B199<INDIRECT($B$1&\"!$C$7\"),H199>0), B199+0.5,\"\"),\"\")","v":""},"",{"$f":"IF(AND(B200<INDIRECT($B$1&\"!$C$7\"),ISNUMBER(B200)),INDIRECT($B$1&\"!$C$16\")*ERFC(0.5*C200*SQRT(INDIRECT($B$1&\"!$F$10\")/(INDIRECT($B$1&\"!$F$9\")*INDIRECT($B$1&\"!$C$20\")*B200))),\"\")","v":""},{"$f":"(INDIRECT($B$1&\"!$F$15\") -D200)/C200","v":{"$error":"#VALUE!"}},{"$f":"IF(ISNUMBER(E200),E200*INDIRECT($B$1&\"!$F$9\")/$G$3,\"\")","v":""},"",{"$f":"IF(B200<INDIRECT($B$1&\"!$C$7\"),H199-G200,\"\")","v":""}]
[null,{"$f":"IF(ISNUMBER(B200),IF(AND(B200<INDIRECT($B$1&\"!$C$7\"),H200>0), B200+0.5,\"\"),\"\")","v":""},"",{"$f":"IF(AND(B201<INDIRECT($B$1&\"!$C$7\"),ISNUMBER(B201)),INDIRECT($B$1&\"!$C$16\")*ERFC(0.5*C201*SQRT(INDIRECT($B$1&\"!$F$10\")/(INDIRECT($B$1&\"!$F$9\")*INDIRECT($B$1&\"!$C$20\")*B201))),\"\")","v":""},{"$f":"(INDIRECT($B$1&\"!$F$15\") -D201)/C201","v":{"$error":"#VALUE!"}},{"$f":"IF(ISNUMBER(E201),E201*INDIRECT($B$1&\"!$F$9\")/$G$3,\"\")","v":""},"",{"$f":"IF(B201<INDIRECT($B$1&\"!$C$7\"),H200-G201,\"\")","v":""}]
[null,{"$f":"IF(ISNUMBER(B201),IF(AND(B201<INDIRECT($B$1&\"!$C$7\"),H201>0), B201+0.5,\"\"),\"\")","v":""},"",{"$f":"IF(AND(B202<INDIRECT($B$1&\"!$C$7\"),ISNUMBER(B202)),INDIRECT($B$1&\"!$C$16\")*ERFC(0.5*C202*SQRT(INDIRECT($B$1&\"!$F$10\")/(INDIRECT($B$1&\"!$F$9\")*INDIRECT($B$1&\"!$C$20\")*B202))),\"\")","v":""},{"$f":"(INDIRECT($B$1&\"!$F$15\") -D202)/C202","v":{"$error":"#VALUE!"}},{"$f":"IF(ISNUMBER(E202),E202*INDIRECT($B$1&\"!$F$9\")/$G$3,\"\")","v":""},"",{"$f":"IF(B202<INDIRECT($B$1&\"!$C$7\"),H201-G202,\"\")","v":""}]
[null,{"$f":"IF(ISNUMBER(B202),IF(AND(B202<INDIRECT($B$1&\"!$C$7\"),H202>0), B202+0.5,\"\"),\"\")","v":""},"",{"$f":"IF(AND(B203<INDIRECT($B$1&\"!$C$7\"),ISNUMBER(B203)),INDIRECT($B$1&\"!$C$16\")*ERFC(0.5*C203*SQRT(INDIRECT($B$1&\"!$F$10\")/(INDIRECT($B$1&\"!$F$9\")*INDIRECT($B$1&\"!$C$20\")*B203))),\"\")","v":""},{"$f":"(INDIRECT($B$1&\"!$F$15\") -D203)/C203","v":{"$error":"#VALUE!"}},{"$f":"IF(ISNUMBER(E203),E203*INDIRECT($B$1&\"!$F$9\")/$G$3,\"\")","v":""},"",{"$f":"IF(B203<INDIRECT($B$1&\"!$C$7\"),H202-G203,\"\")","v":""}]
[null,{"$f":"IF(ISNUMBER(B203),IF(AND(B203<INDIRECT($B$1&\"!$C$7\"),H203>0), B203+0.5,\"\"),\"\")","v":""},"",{"$f":"IF(AND(B204<INDIRECT($B$1&\"!$C$7\"),ISNUMBER(B204)),INDIRECT($B$1&\"!$C$16\")*ERFC(0.5*C204*SQRT(INDIRECT($B$1&\"!$F$10\")/(INDIRECT($B$1&\"!$F$9\")*INDIRECT($B$1&\"!$C$20\")*B204))),\"\")","v":""},{"$f":"(INDIRECT($B$1&\"!$F$15\") -D204)/C204","v":{"$error":"#VALUE!"}},{"$f":"IF(ISNUMBER(E204),E204*INDIRECT($B$1&\"!$F$9\")/$G$3,\"\")","v":""},"",{"$f":"IF(B204<INDIRECT($B$1&\"!$C$7\"),H203-G204,\"\")","v":""}]
[null,{"$f":"IF(ISNUMBER(B204),IF(AND(B204<INDIRECT($B$1&\"!$C$7\"),H204>0), B204+0.5,\"\"),\"\")","v":""},"",{"$f":"IF(AND(B205<INDIRECT($B$1&\"!$C$7\"),ISNUMBER(B205)),INDIRECT($B$1&\"!$C$16\")*ERFC(0.5*C205*SQRT(INDIRECT($B$1&\"!$F$10\")/(INDIRECT($B$1&\"!$F$9\")*INDIRECT($B$1&\"!$C$20\")*B205))),\"\")","v":""},{"$f":"(INDIRECT($B$1&\"!$F$15\") -D205)/C205","v":{"$error":"#VALUE!"}},{"$f":"IF(ISNUMBER(E205),E205*INDIRECT($B$1&\"!$F$9\")/$G$3,\"\")","v":""},"",{"$f":"IF(B205<INDIRECT($B$1&\"!$C$7\"),H204-G205,\"\")","v":""}]
[null,{"$f":"IF(ISNUMBER(B205),IF(AND(B205<INDIRECT($B$1&\"!$C$7\"),H205>0), B205+0.5,\"\"),\"\")","v":""},"",{"$f":"IF(AND(B206<INDIRECT($B$1&\"!$C$7\"),ISNUMBER(B206)),INDIRECT($B$1&\"!$C$16\")*ERFC(0.5*C206*SQRT(INDIRECT($B$1&\"!$F$10\")/(INDIRECT($B$1&\"!$F$9\")*INDIRECT($B$1&\"!$C$20\")*B206))),\"\")","v":""},{"$f":"(INDIRECT($B$1&\"!$F$15\") -D206)/C206","v":{"$error":"#VALUE!"}},{"$f":"IF(ISNUMBER(E206),E206*INDIRECT($B$1&\"!$F$9\")/$G$3,\"\")","v":""},"",{"$f":"IF(B206<INDIRECT($B$1&\"!$C$7\"),H205-G206,\"\")","v":""}]
[null,{"$f":"IF(ISNUMBER(B206),IF(AND(B206<INDIRECT($B$1&\"!$C$7\"),H206>0), B206+0.5,\"\"),\"\")","v":""},"",{"$f":"IF(AND(B207<INDIRECT($B$1&\"!$C$7\"),ISNUMBER(B207)),INDIRECT($B$1&\"!$C$16\")*ERFC(0.5*C207*SQRT(INDIRECT($B$1&\"!$F$10\")/(INDIRECT($B$1&\"!$F$9\")*INDIRECT($B$1&\"!$C$20\")*B207))),\"\")","v":""},{"$f":"(INDIRECT($B$1&\"!$F$15\") -D207)/C207","v":{"$error":"#VALUE!"}},{"$f":"IF(ISNUMBER(E207),E207*INDIRECT($B$1&\"!$F$9\")/$G$3,\"\")","v":""},"",{"$f":"IF(B207<INDIRECT($B$1&\"!$C$7\"),H206-G207,\"\")","v":""}]
[null,{"$f":"IF(ISNUMBER(B207),IF(AND(B207<INDIRECT($B$1&\"!$C$7\"),H207>0), B207+0.5,\"\"),\"\")","v":""},"",{"$f":"IF(AND(B208<INDIRECT($B$1&\"!$C$7\"),ISNUMBER(B208)),INDIRECT($B$1&\"!$C$16\")*ERFC(0.5*C208*SQRT(INDIRECT($B$1&\"!$F$10\")/(INDIRECT($B$1&\"!$F$9\")*INDIRECT($B$1&\"!$C$20\")*B208))),\"\")","v":""},{"$f":"(INDIRECT($B$1&\"!$F$15\") -D208)/C208","v":{"$error":"#VALUE!"}},{"$f":"IF(ISNUMBER(E208),E208*INDIRECT($B$1&\"!$F$9\")/$G$3,\"\")","v":""},"",{"$f":"IF(B208<INDIRECT($B$1&\"!$C$7\"),H207-G208,\"\")","v":""}]
[null,{"$f":"IF(ISNUMBER(B208),IF(AND(B208<INDIRECT($B$1&\"!$C$7\"),H208>0), B208+0.5,\"\"),\"\")","v":""},"",{"$f":"IF(AND(B209<INDIRECT($B$1&\"!$C$7\"),ISNUMBER(B209)),INDIRECT($B$1&\"!$C$16\")*ERFC(0.5*C209*SQRT(INDIRECT($B$1&\"!$F$10\")/(INDIRECT($B$1&\"!$F$9\")*INDIRECT($B$1&\"!$C$20\")*B209))),\"\")","v":""},{"$f":"(INDIRECT($B$1&\"!$F$15\") -D209)/C209","v":{"$error":"#VALUE!"}},{"$f":"IF(ISNUMBER(E209),E209*INDIRECT($B$1&\"!$F$9\")/$G$3,\"\")","v":""},"",{"$f":"IF(B209<INDIRECT($B$1&\"!$C$7\"),H208-G209,\"\")","v":""}]
[null,{"$f":"IF(ISNUMBER(B209),IF(AND(B209<INDIRECT($B$1&\"!$C$7\"),H209>0), B209+0.5,\"\"),\"\")","v":""},"",{"$f":"IF(AND(B210<INDIRECT($B$1&\"!$C$7\"),ISNUMBER(B210)),INDIRECT($B$1&\"!$C$16\")*ERFC(0.5*C210*SQRT(INDIRECT($B$1&\"!$F$10\")/(INDIRECT($B$1&\"!$F$9\")*INDIRECT($B$1&\"!$C$20\")*B210))),\"\")","v":""},{"$f":"(INDIRECT($B$1&\"!$F$15\") -D210)/C210","v":{"$error":"#VALUE!"}},{"$f":"IF(ISNUMBER(E210),E210*INDIRECT($B$1&\"!$F$9\")/$G$3,\"\")","v":""},"",{"$f":"IF(B210<INDIRECT($B$1&\"!$C$7\"),H209-G210,\"\")","v":""}]
[null,{"$f":"IF(ISNUMBER(B210),IF(AND(B210<INDIRECT($B$1&\"!$C$7\"),H210>0), B210+0.5,\"\"),\"\")","v":""},"",{"$f":"IF(AND(B211<INDIRECT($B$1&\"!$C$7\"),ISNUMBER(B211)),INDIRECT($B$1&\"!$C$16\")*ERFC(0.5*C211*SQRT(INDIRECT($B$1&\"!$F$10\")/(INDIRECT($B$1&\"!$F$9\")*INDIRECT($B$1&\"!$C$20\")*B211))),\"\")","v":""},{"$f":"(INDIRECT($B$1&\"!$F$15\") -D211)/C211","v":{"$error":"#VALUE!"}},{"$f":"IF(ISNUMBER(E211),E211*INDIRECT($B$1&\"!$F$9\")/$G$3,\"\")","v":""},"",{"$f":"IF(B211<INDIRECT($B$1&\"!$C$7\"),H210-G211,\"\")","v":""}]
[null,{"$f":"IF(ISNUMBER(B211),IF(AND(B211<INDIRECT($B$1&\"!$C$7\"),H211>0), B211+0.5,\"\"),\"\")","v":""},"",{"$f":"IF(AND(B212<INDIRECT($B$1&\"!$C$7\"),ISNUMBER(B212)),INDIRECT($B$1&\"!$C$16\")*ERFC(0.5*C212*SQRT(INDIRECT($B$1&\"!$F$10\")/(INDIRECT($B$1&\"!$F$9\")*INDIRECT($B$1&\"!$C$20\")*B212))),\"\")","v":""},{"$f":"(INDIRECT($B$1&\"!$F$15\") -D212)/C212","v":{"$error":"#VALUE!"}},{"$f":"IF(ISNUMBER(E212),E212*INDIRECT($B$1&\"!$F$9\")/$G$3,\"\")","v":""},"",{"$f":"IF(B212<INDIRECT($B$1&\"!$C$7\"),H211-G212,\"\")","v":""}]
[null,{"$f":"IF(ISNUMBER(B212),IF(AND(B212<INDIRECT($B$1&\"!$C$7\"),H212>0), B212+0.5,\"\"),\"\")","v":""},"",{"$f":"IF(AND(B213<INDIRECT($B$1&\"!$C$7\"),ISNUMBER(B213)),INDIRECT($B$1&\"!$C$16\")*ERFC(0.5*C213*SQRT(INDIRECT($B$1&\"!$F$10\")/(INDIRECT($B$1&\"!$F$9\")*INDIRECT($B$1&\"!$C$20\")*B213))),\"\")","v":""},{"$f":"(INDIRECT($B$1&\"!$F$15\") -D213)/C213","v":{"$error":"#VALUE!"}},{"$f":"IF(ISNUMBER(E213),E213*INDIRECT($B$1&\"!$F$9\")/$G$3,\"\")","v":""},"",{"$f":"IF(B213<INDIRECT($B$1&\"!$C$7\"),H212-G213,\"\")","v":""}]
[null,{"$f":"IF(ISNUMBER(B213),IF(AND(B213<INDIRECT($B$1&\"!$C$7\"),H213>0), B213+0.5,\"\"),\"\")","v":""},"",{"$f":"IF(AND(B214<INDIRECT($B$1&\"!$C$7\"),ISNUMBER(B214)),INDIRECT($B$1&\"!$C$16\")*ERFC(0.5*C214*SQRT(INDIRECT($B$1&\"!$F$10\")/(INDIRECT($B$1&\"!$F$9\")*INDIRECT($B$1&\"!$C$20\")*B214))),\"\")","v":""},{"$f":"(INDIRECT($B$1&\"!$F$15\") -D214)/C214","v":{"$error":"#VALUE!"}},{"$f":"IF(ISNUMBER(E214),E214*INDIRECT($B$1&\"!$F$9\")/$G$3,\"\")","v":""},"",{"$f":"IF(B214<INDIRECT($B$1&\"!$C$7\"),H213-G214,\"\")","v":""}]
[null,{"$f":"IF(ISNUMBER(B214),IF(AND(B214<INDIRECT($B$1&\"!$C$7\"),H214>0), B214+0.5,\"\"),\"\")","v":""},"",{"$f":"IF(AND(B215<INDIRECT($B$1&\"!$C$7\"),ISNUMBER(B215)),INDIRECT($B$1&\"!$C$16\")*ERFC(0.5*C215*SQRT(INDIRECT($B$1&\"!$F$10\")/(INDIRECT($B$1&\"!$F$9\")*INDIRECT($B$1&\"!$C$20\")*B215))),\"\")","v":""},{"$f":"(INDIRECT($B$1&\"!$F$15\") -D215)/C215","v":{"$error":"#VALUE!"}},{"$f":"IF(ISNUMBER(E215),E215*INDIRECT($B$1&\"!$F$9\")/$G$3,\"\")","v":""},"",{"$f":"IF(B215<INDIRECT($B$1&\"!$C$7\"),H214-G215,\"\")","v":""}]
[null,{"$f":"IF(ISNUMBER(B215),IF(AND(B215<INDIRECT($B$1&\"!$C$7\"),H215>0), B215+0.5,\"\"),\"\")","v":""},"",{"$f":"IF(AND(B216<INDIRECT($B$1&\"!$C$7\"),ISNUMBER(B216)),INDIRECT($B$1&\"!$C$16\")*ERFC(0.5*C216*SQRT(INDIRECT($B$1&\"!$F$10\")/(INDIRECT($B$1&\"!$F$9\")*INDIRECT($B$1&\"!$C$20\")*B216))),\"\")","v":""},{"$f":"(INDIRECT($B$1&\"!$F$15\") -D216)/C216","v":{"$error":"#VALUE!"}},{"$f":"IF(ISNUMBER(E216),E216*INDIRECT($B$1&\"!$F$9\")/$G$3,\"\")","v":""},"",{"$f":"IF(B216<INDIRECT($B$1&\"!$C$7\"),H215-G216,\"\")","v":""}]
[null,{"$f":"IF(ISNUMBER(B216),IF(AND(B216<INDIRECT($B$1&\"!$C$7\"),H216>0), B216+0.5,\"\"),\"\")","v":""},"",{"$f":"IF(AND(B217<INDIRECT($B$1&\"!$C$7\"),ISNUMBER(B217)),INDIRECT($B$1&\"!$C$16\")*ERFC(0.5*C217*SQRT(INDIRECT($B$1&\"!$F$10\")/(INDIRECT($B$1&\"!$F$9\")*INDIRECT($B$1&\"!$C$20\")*B217))),\"\")","v":""},{"$f":"(INDIRECT($B$1&\"!$F$15\") -D217)/C217","v":{"$error":"#VALUE!"}},{"$f":"IF(ISNUMBER(E217),E217*INDIRECT($B$1&\"!$F$9\")/$G$3,\"\")","v":""},"",{"$f":"IF(B217<INDIRECT($B$1&\"!$C$7\"),H216-G217,\"\")","v":""}]
[null,{"$f":"IF(ISNUMBER(B217),IF(AND(B217<INDIRECT($B$1&\"!$C$7\"),H217>0), B217+0.5,\"\"),\"\")","v":""},"",{"$f":"IF(AND(B218<INDIRECT($B$1&\"!$C$7\"),ISNUMBER(B218)),INDIRECT($B$1&\"!$C$16\")*ERFC(0.5*C218*SQRT(INDIRECT($B$1&\"!$F$10\")/(INDIRECT($B$1&\"!$F$9\")*INDIRECT($B$1&\"!$C$20\")*B218))),\"\")","v":""},{"$f":"(INDIRECT($B$1&\"!$F$15\") -D218)/C218","v":{"$error":"#VALUE!"}},{"$f":"IF(ISNUMBER(E218),E218*INDIRECT($B$1&\"!$F$9\")/$G$3,\"\")","v":""},"",{"$f":"IF(B218<INDIRECT($B$1&\"!$C$7\"),H217-G218,\"\")","v":""}]
[null,{"$f":"IF(ISNUMBER(B218),IF(AND(B218<INDIRECT($B$1&\"!$C$7\"),H218>0), B218+0.5,\"\"),\"\")","v":""},"",{"$f":"IF(AND(B219<INDIRECT($B$1&\"!$C$7\"),ISNUMBER(B219)),INDIRECT($B$1&\"!$C$16\")*ERFC(0.5*C219*SQRT(INDIRECT($B$1&\"!$F$10\")/(INDIRECT($B$1&\"!$F$9\")*INDIRECT($B$1&\"!$C$20\")*B219))),\"\")","v":""},{"$f":"(INDIRECT($B$1&\"!$F$15\") -D219)/C219","v":{"$error":"#VALUE!"}},{"$f":"IF(ISNUMBER(E219),E219*INDIRECT($B$1&\"!$F$9\")/$G$3,\"\")","v":""},"",{"$f":"IF(B219<INDIRECT($B$1&\"!$C$7\"),H218-G219,\"\")","v":""}]
[null,{"$f":"IF(ISNUMBER(B219),IF(AND(B219<INDIRECT($B$1&\"!$C$7\"),H219>0), B219+0.5,\"\"),\"\")","v":""},"",{"$f":"IF(AND(B220<INDIRECT($B$1&\"!$C$7\"),ISNUMBER(B220)),INDIRECT($B$1&\"!$C$16\")*ERFC(0.5*C220*SQRT(INDIRECT($B$1&\"!$F$10\")/(INDIRECT($B$1&\"!$F$9\")*INDIRECT($B$1&\"!$C$20\")*B220))),\"\")","v":""},{"$f":"(INDIRECT($B$1&\"!$F$15\") -D220)/C220","v":{"$error":"#VALUE!"}},{"$f":"IF(ISNUMBER(E220),E220*INDIRECT($B$1&\"!$F$9\")/$G$3,\"\")","v":""},"",{"$f":"IF(B220<INDIRECT($B$1&\"!$C$7\"),H219-G220,\"\")","v":""}]
[null,{"$f":"IF(ISNUMBER(B220),IF(AND(B220<INDIRECT($B$1&\"!$C$7\"),H220>0), B220+0.5,\"\"),\"\")","v":""},"",{"$f":"IF(AND(B221<INDIRECT($B$1&\"!$C$7\"),ISNUMBER(B221)),INDIRECT($B$1&\"!$C$16\")*ERFC(0.5*C221*SQRT(INDIRECT($B$1&\"!$F$10\")/(INDIRECT($B$1&\"!$F$9\")*INDIRECT($B$1&\"!$C$20\")*B221))),\"\")","v":""},{"$f":"(INDIRECT($B$1&\"!$F$15\") -D221)/C221","v":{"$error":"#VALUE!"}},{"$f":"IF(ISNUMBER(E221),E221*INDIRECT($B$1&\"!$F$9\")/$G$3,\"\")","v":""},"",{"$f":"IF(B221<INDIRECT($B$1&\"!$C$7\"),H220-G221,\"\")","v":""}]
[null,{"$f":"IF(ISNUMBER(B221),IF(AND(B221<INDIRECT($B$1&\"!$C$7\"),H221>0), B221+0.5,\"\"),\"\")","v":""},"",{"$f":"IF(AND(B222<INDIRECT($B$1&\"!$C$7\"),ISNUMBER(B222)),INDIRECT($B$1&\"!$C$16\")*ERFC(0.5*C222*SQRT(INDIRECT($B$1&\"!$F$10\")/(INDIRECT($B$1&\"!$F$9\")*INDIRECT($B$1&\"!$C$20\")*B222))),\"\")","v":""},{"$f":"(INDIRECT($B$1&\"!$F$15\") -D222)/C222","v":{"$error":"#VALUE!"}},{"$f":"IF(ISNUMBER(E222),E222*INDIRECT($B$1&\"!$F$9\")/$G$3,\"\")","v":""},"",{"$f":"IF(B222<INDIRECT($B$1&\"!$C$7\"),H221-G222,\"\")","v":""}]
[null,{"$f":"IF(ISNUMBER(B222),IF(AND(B222<INDIRECT($B$1&\"!$C$7\"),H222>0), B222+0.5,\"\"),\"\")","v":""},"",{"$f":"IF(AND(B223<INDIRECT($B$1&\"!$C$7\"),ISNUMBER(B223)),INDIRECT($B$1&\"!$C$16\")*ERFC(0.5*C223*SQRT(INDIRECT($B$1&\"!$F$10\")/(INDIRECT($B$1&\"!$F$9\")*INDIRECT($B$1&\"!$C$20\")*B223))),\"\")","v":""},{"$f":"(INDIRECT($B$1&\"!$F$15\") -D223)/C223","v":{"$error":"#VALUE!"}},{"$f":"IF(ISNUMBER(E223),E223*INDIRECT($B$1&\"!$F$9\")/$G$3,\"\")","v":""},"",{"$f":"IF(B223<INDIRECT($B$1&\"!$C$7\"),H222-G223,\"\")","v":""}]
[null,{"$f":"IF(ISNUMBER(B223),IF(AND(B223<INDIRECT($B$1&\"!$C$7\"),H223>0), B223+0.5,\"\"),\"\")","v":""},"",{"$f":"IF(AND(B224<INDIRECT($B$1&\"!$C$7\"),ISNUMBER(B224)),INDIRECT($B$1&\"!$C$16\")*ERFC(0.5*C224*SQRT(INDIRECT($B$1&\"!$F$10\")/(INDIRECT($B$1&\"!$F$9\")*INDIRECT($B$1&\"!$C$20\")*B224))),\"\")","v":""},{"$f":"(INDIRECT($B$1&\"!$F$15\") -D224)/C224","v":{"$error":"#VALUE!"}},{"$f":"IF(ISNUMBER(E224),E224*INDIRECT($B$1&\"!$F$9\")/$G$3,\"\")","v":""},"",{"$f":"IF(B224<INDIRECT($B$1&\"!$C$7\"),H223-G224,\"\")","v":""}]
[null,{"$f":"IF(ISNUMBER(B224),IF(AND(B224<INDIRECT($B$1&\"!$C$7\"),H224>0), B224+0.5,\"\"),\"\")","v":""},"",{"$f":"IF(AND(B225<INDIRECT($B$1&\"!$C$7\"),ISNUMBER(B225)),INDIRECT($B$1&\"!$C$16\")*ERFC(0.5*C225*SQRT(INDIRECT($B$1&\"!$F$10\")/(INDIRECT($B$1&\"!$F$9\")*INDIRECT($B$1&\"!$C$20\")*B225))),\"\")","v":""},{"$f":"(INDIRECT($B$1&\"!$F$15\") -D225)/C225","v":{"$error":"#VALUE!"}},{"$f":"IF(ISNUMBER(E225),E225*INDIRECT($B$1&\"!$F$9\")/$G$3,\"\")","v":""},"",{"$f":"IF(B225<INDIRECT($B$1&\"!$C$7\"),H224-G225,\"\")","v":""}]
[null,{"$f":"IF(ISNUMBER(B225),IF(AND(B225<INDIRECT($B$1&\"!$C$7\"),H225>0), B225+0.5,\"\"),\"\")","v":""},"",{"$f":"IF(AND(B226<INDIRECT($B$1&\"!$C$7\"),ISNUMBER(B226)),INDIRECT($B$1&\"!$C$16\")*ERFC(0.5*C226*SQRT(INDIRECT($B$1&\"!$F$10\")/(INDIRECT($B$1&\"!$F$9\")*INDIRECT($B$1&\"!$C$20\")*B226))),\"\")","v":""},{"$f":"(INDIRECT($B$1&\"!$F$15\") -D226)/C226","v":{"$error":"#VALUE!"}},{"$f":"IF(ISNUMBER(E226),E226*INDIRECT($B$1&\"!$F$9\")/$G$3,\"\")","v":""},"",{"$f":"IF(B226<INDIRECT($B$1&\"!$C$7\"),H225-G226,\"\")","v":""}]
[null,{"$f":"IF(ISNUMBER(B226),IF(AND(B226<INDIRECT($B$1&\"!$C$7\"),H226>0), B226+0.5,\"\"),\"\")","v":""},"",{"$f":"IF(AND(B227<INDIRECT($B$1&\"!$C$7\"),ISNUMBER(B227)),INDIRECT($B$1&\"!$C$16\")*ERFC(0.5*C227*SQRT(INDIRECT($B$1&\"!$F$10\")/(INDIRECT($B$1&\"!$F$9\")*INDIRECT($B$1&\"!$C$20\")*B227))),\"\")","v":""},{"$f":"(INDIRECT($B$1&\"!$F$15\") -D227)/C227","v":{"$error":"#VALUE!"}},{"$f":"IF(ISNUMBER(E227),E227*INDIRECT($B$1&\"!$F$9\")/$G$3,\"\")","v":""},"",{"$f":"IF(B227<INDIRECT($B$1&\"!$C$7\"),H226-G227,\"\")","v":""}]
[null,{"$f":"IF(ISNUMBER(B227),IF(AND(B227<INDIRECT($B$1&\"!$C$7\"),H227>0), B227+0.5,\"\"),\"\")","v":""},"",{"$f":"IF(AND(B228<INDIRECT($B$1&\"!$C$7\"),ISNUMBER(B228)),INDIRECT($B$1&\"!$C$16\")*ERFC(0.5*C228*SQRT(INDIRECT($B$1&\"!$F$10\")/(INDIRECT($B$1&\"!$F$9\")*INDIRECT($B$1&\"!$C$20\")*B228))),\"\")","v":""},{"$f":"(INDIRECT($B$1&\"!$F$15\") -D228)/C228","v":{"$error":"#VALUE!"}},{"$f":"IF(ISNUMBER(E228),E228*INDIRECT($B$1&\"!$F$9\")/$G$3,\"\")","v":""},"",{"$f":"IF(B228<INDIRECT($B$1&\"!$C$7\"),H227-G228,\"\")","v":""}]
[null,{"$f":"IF(ISNUMBER(B228),IF(AND(B228<INDIRECT($B$1&\"!$C$7\"),H228>0), B228+0.5,\"\"),\"\")","v":""},"",{"$f":"IF(AND(B229<INDIRECT($B$1&\"!$C$7\"),ISNUMBER(B229)),INDIRECT($B$1&\"!$C$16\")*ERFC(0.5*C229*SQRT(INDIRECT($B$1&\"!$F$10\")/(INDIRECT($B$1&\"!$F$9\")*INDIRECT($B$1&\"!$C$20\")*B229))),\"\")","v":""},{"$f":"(INDIRECT($B$1&\"!$F$15\") -D229)/C229","v":{"$error":"#VALUE!"}},{"$f":"IF(ISNUMBER(E229),E229*INDIRECT($B$1&\"!$F$9\")/$G$3,\"\")","v":""},"",{"$f":"IF(B229<INDIRECT($B$1&\"!$C$7\"),H228-G229,\"\")","v":""}]
[null,{"$f":"IF(ISNUMBER(B229),IF(AND(B229<INDIRECT($B$1&\"!$C$7\"),H229>0), B229+0.5,\"\"),\"\")","v":""},"",{"$f":"IF(AND(B230<INDIRECT($B$1&\"!$C$7\"),ISNUMBER(B230)),INDIRECT($B$1&\"!$C$16\")*ERFC(0.5*C230*SQRT(INDIRECT($B$1&\"!$F$10\")/(INDIRECT($B$1&\"!$F$9\")*INDIRECT($B$1&\"!$C$20\")*B230))),\"\")","v":""},{"$f":"(INDIRECT($B$1&\"!$F$15\") -D230)/C230","v":{"$error":"#VALUE!"}},{"$f":"IF(ISNUMBER(E230),E230*INDIRECT($B$1&\"!$F$9\")/$G$3,\"\")","v":""},"",{"$f":"IF(B230<INDIRECT($B$1&\"!$C$7\"),H229-G230,\"\")","v":""}]
[null,{"$f":"IF(ISNUMBER(B230),IF(AND(B230<INDIRECT($B$1&\"!$C$7\"),H230>0), B230+0.5,\"\"),\"\")","v":""},"",{"$f":"IF(AND(B231<INDIRECT($B$1&\"!$C$7\"),ISNUMBER(B231)),INDIRECT($B$1&\"!$C$16\")*ERFC(0.5*C231*SQRT(INDIRECT($B$1&\"!$F$10\")/(INDIRECT($B$1&\"!$F$9\")*INDIRECT($B$1&\"!$C$20\")*B231))),\"\")","v":""},{"$f":"(INDIRECT($B$1&\"!$F$15\") -D231)/C231","v":{"$error":"#VALUE!"}},{"$f":"IF(ISNUMBER(E231),E231*INDIRECT($B$1&\"!$F$9\")/$G$3,\"\")","v":""},"",{"$f":"IF(B231<INDIRECT($B$1&\"!$C$7\"),H230-G231,\"\")","v":""}]
[null,{"$f":"IF(ISNUMBER(B231),IF(AND(B231<INDIRECT($B$1&\"!$C$7\"),H231>0), B231+0.5,\"\"),\"\")","v":""},"",{"$f":"IF(AND(B232<INDIRECT($B$1&\"!$C$7\"),ISNUMBER(B232)),INDIRECT($B$1&\"!$C$16\")*ERFC(0.5*C232*SQRT(INDIRECT($B$1&\"!$F$10\")/(INDIRECT($B$1&\"!$F$9\")*INDIRECT($B$1&\"!$C$20\")*B232))),\"\")","v":""},{"$f":"(INDIRECT($B$1&\"!$F$15\") -D232)/C232","v":{"$error":"#VALUE!"}},{"$f":"IF(ISNUMBER(E232),E232*INDIRECT($B$1&\"!$F$9\")/$G$3,\"\")","v":""},"",{"$f":"IF(B232<INDIRECT($B$1&\"!$C$7\"),H231-G232,\"\")","v":""}]
[null,{"$f":"IF(ISNUMBER(B232),IF(AND(B232<INDIRECT($B$1&\"!$C$7\"),H232>0), B232+0.5,\"\"),\"\")","v":""},"",{"$f":"IF(AND(B233<INDIRECT($B$1&\"!$C$7\"),ISNUMBER(B233)),INDIRECT($B$1&\"!$C$16\")*ERFC(0.5*C233*SQRT(INDIRECT($B$1&\"!$F$10\")/(INDIRECT($B$1&\"!$F$9\")*INDIRECT($B$1&\"!$C$20\")*B233))),\"\")","v":""},{"$f":"(INDIRECT($B$1&\"!$F$15\") -D233)/C233","v":{"$error":"#VALUE!"}},{"$f":"IF(ISNUMBER(E233),E233*INDIRECT($B$1&\"!$F$9\")/$G$3,\"\")","v":""},"",{"$f":"IF(B233<INDIRECT($B$1&\"!$C$7\"),H232-G233,\"\")","v":""}]
[null,{"$f":"IF(ISNUMBER(B233),IF(AND(B233<INDIRECT($B$1&\"!$C$7\"),H233>0), B233+0.5,\"\"),\"\")","v":""},"",{"$f":"IF(AND(B234<INDIRECT($B$1&\"!$C$7\"),ISNUMBER(B234)),INDIRECT($B$1&\"!$C$16\")*ERFC(0.5*C234*SQRT(INDIRECT($B$1&\"!$F$10\")/(INDIRECT($B$1&\"!$F$9\")*INDIRECT($B$1&\"!$C$20\")*B234))),\"\")","v":""},{"$f":"(INDIRECT($B$1&\"!$F$15\") -D234)/C234","v":{"$error":"#VALUE!"}},{"$f":"IF(ISNUMBER(E234),E234*INDIRECT($B$1&\"!$F$9\")/$G$3,\"\")","v":""},"",{"$f":"IF(B234<INDIRECT($B$1&\"!$C$7\"),H233-G234,\"\")","v":""}]
[null,{"$f":"IF(ISNUMBER(B234),IF(AND(B234<INDIRECT($B$1&\"!$C$7\"),H234>0), B234+0.5,\"\"),\"\")","v":""},"",{"$f":"IF(AND(B235<INDIRECT($B$1&\"!$C$7\"),ISNUMBER(B235)),INDIRECT($B$1&\"!$C$16\")*ERFC(0.5*C235*SQRT(INDIRECT($B$1&\"!$F$10\")/(INDIRECT($B$1&\"!$F$9\")*INDIRECT($B$1&\"!$C$20\")*B235))),\"\")","v":""},{"$f":"(INDIRECT($B$1&\"!$F$15\") -D235)/C235","v":{"$error":"#VALUE!"}},{"$f":"IF(ISNUMBER(E235),E235*INDIRECT($B$1&\"!$F$9\")/$G$3,\"\")","v":""},"",{"$f":"IF(B235<INDIRECT($B$1&\"!$C$7\"),H234-G235,\"\")","v":""}]
[null,{"$f":"IF(ISNUMBER(B235),IF(AND(B235<INDIRECT($B$1&\"!$C$7\"),H235>0), B235+0.5,\"\"),\"\")","v":""},"",{"$f":"IF(AND(B236<INDIRECT($B$1&\"!$C$7\"),ISNUMBER(B236)),INDIRECT($B$1&\"!$C$16\")*ERFC(0.5*C236*SQRT(INDIRECT($B$1&\"!$F$10\")/(INDIRECT($B$1&\"!$F$9\")*INDIRECT($B$1&\"!$C$20\")*B236))),\"\")","v":""},{"$f":"(INDIRECT($B$1&\"!$F$15\") -D236)/C236","v":{"$error":"#VALUE!"}},{"$f":"IF(ISNUMBER(E236),E236*INDIRECT($B$1&\"!$F$9\")/$G$3,\"\")","v":""},"",{"$f":"IF(B236<INDIRECT($B$1&\"!$C$7\"),H235-G236,\"\")","v":""}]
[null,{"$f":"IF(ISNUMBER(B236),IF(AND(B236<INDIRECT($B$1&\"!$C$7\"),H236>0), B236+0.5,\"\"),\"\")","v":""},"",{"$f":"IF(AND(B237<INDIRECT($B$1&\"!$C$7\"),ISNUMBER(B237)),INDIRECT($B$1&\"!$C$16\")*ERFC(0.5*C237*SQRT(INDIRECT($B$1&\"!$F$10\")/(INDIRECT($B$1&\"!$F$9\")*INDIRECT($B$1&\"!$C$20\")*B237))),\"\")","v":""},{"$f":"(INDIRECT($B$1&\"!$F$15\") -D237)/C237","v":{"$error":"#VALUE!"}},{"$f":"IF(ISNUMBER(E237),E237*INDIRECT($B$1&\"!$F$9\")/$G$3,\"\")","v":""},"",{"$f":"IF(B237<INDIRECT($B$1&\"!$C$7\"),H236-G237,\"\")","v":""}]
[null,{"$f":"IF(ISNUMBER(B237),IF(AND(B237<INDIRECT($B$1&\"!$C$7\"),H237>0), B237+0.5,\"\"),\"\")","v":""},"",{"$f":"IF(AND(B238<INDIRECT($B$1&\"!$C$7\"),ISNUMBER(B238)),INDIRECT($B$1&\"!$C$16\")*ERFC(0.5*C238*SQRT(INDIRECT($B$1&\"!$F$10\")/(INDIRECT($B$1&\"!$F$9\")*INDIRECT($B$1&\"!$C$20\")*B238))),\"\")","v":""},{"$f":"(INDIRECT($B$1&\"!$F$15\") -D238)/C238","v":{"$error":"#VALUE!"}},{"$f":"IF(ISNUMBER(E238),E238*INDIRECT($B$1&\"!$F$9\")/$G$3,\"\")","v":""},"",{"$f":"IF(B238<INDIRECT($B$1&\"!$C$7\"),H237-G238,\"\")","v":""}]
[null,{"$f":"IF(ISNUMBER(B238),IF(AND(B238<INDIRECT($B$1&\"!$C$7\"),H238>0), B238+0.5,\"\"),\"\")","v":""},"",{"$f":"IF(AND(B239<INDIRECT($B$1&\"!$C$7\"),ISNUMBER(B239)),INDIRECT($B$1&\"!$C$16\")*ERFC(0.5*C239*SQRT(INDIRECT($B$1&\"!$F$10\")/(INDIRECT($B$1&\"!$F$9\")*INDIRECT($B$1&\"!$C$20\")*B239))),\"\")","v":""},{"$f":"(INDIRECT($B$1&\"!$F$15\") -D239)/C239","v":{"$error":"#VALUE!"}},{"$f":"IF(ISNUMBER(E239),E239*INDIRECT($B$1&\"!$F$9\")/$G$3,\"\")","v":""},"",{"$f":"IF(B239<INDIRECT($B$1&\"!$C$7\"),H238-G239,\"\")","v":""}]
[null,{"$f":"IF(ISNUMBER(B239),IF(AND(B239<INDIRECT($B$1&\"!$C$7\"),H239>0), B239+0.5,\"\"),\"\")","v":""},"",{"$f":"IF(AND(B240<INDIRECT($B$1&\"!$C$7\"),ISNUMBER(B240)),INDIRECT($B$1&\"!$C$16\")*ERFC(0.5*C240*SQRT(INDIRECT($B$1&\"!$F$10\")/(INDIRECT($B$1&\"!$F$9\")*INDIRECT($B$1&\"!$C$20\")*B240))),\"\")","v":""},{"$f":"(INDIRECT($B$1&\"!$F$15\") -D240)/C240","v":{"$error":"#VALUE!"}},{"$f":"IF(ISNUMBER(E240),E240*INDIRECT($B$1&\"!$F$9\")/$G$3,\"\")","v":""},"",{"$f":"IF(B240<INDIRECT($B$1&\"!$C$7\"),H239-G240,\"\")","v":""}]
[null,{"$f":"IF(ISNUMBER(B240),IF(AND(B240<INDIRECT($B$1&\"!$C$7\"),H240>0), B240+0.5,\"\"),\"\")","v":""},{"$f":"IF(ISNUMBER(B241),H240,\"\")","v":""},{"$f":"IF(AND(B241<INDIRECT($B$1&\"!$C$7\"),ISNUMBER(B241)),INDIRECT($B$1&\"!$C$16\")*ERFC(0.5*C241*SQRT(INDIRECT($B$1&\"!$F$10\")/(INDIRECT($B$1&\"!$F$9\")*INDIRECT($B$1&\"!$C$20\")*B241))),\"\")","v":""},{"$f":"(INDIRECT($B$1&\"!$F$15\") -D241)/C241","v":{"$error":"#VALUE!"}},{"$f":"IF(ISNUMBER(E241),E241*INDIRECT($B$1&\"!$F$9\")/$G$3,\"\")","v":""},{"$f":"IF(ISNUMBER(F241),F241*ABS(B240-B241)/$I$3,\"\")","v":""},{"$f":"IF(B241<INDIRECT($B$1&\"!$C$7\"),H240-G241,\"\")","v":""}]
[null,{"$f":"IF(ISNUMBER(B241),IF(AND(B241<INDIRECT($B$1&\"!$C$7\"),H241>0), B241+0.5,\"\"),\"\")","v":""},"",{"$f":"IF(AND(B242<INDIRECT($B$1&\"!$C$7\"),ISNUMBER(B242)),INDIRECT($B$1&\"!$C$16\")*ERFC(0.5*C242*SQRT(INDIRECT($B$1&\"!$F$10\")/(INDIRECT($B$1&\"!$F$9\")*INDIRECT($B$1&\"!$C$20\")*B242))),\"\")","v":""},{"$f":"(INDIRECT($B$1&\"!$F$15\") -D242)/C242","v":{"$error":"#VALUE!"}},{"$f":"IF(ISNUMBER(E242),E242*INDIRECT($B$1&\"!$F$9\")/$G$3,\"\")","v":""},"",{"$f":"IF(B242<INDIRECT($B$1&\"!$C$7\"),H241-G242,\"\")","v":""}]
[null,{"$f":"IF(ISNUMBER(B242),IF(AND(B242<INDIRECT($B$1&\"!$C$7\"),H242>0), B242+0.5,\"\"),\"\")","v":""},"",{"$f":"IF(AND(B243<INDIRECT($B$1&\"!$C$7\"),ISNUMBER(B243)),INDIRECT($B$1&\"!$C$16\")*ERFC(0.5*C243*SQRT(INDIRECT($B$1&\"!$F$10\")/(INDIRECT($B$1&\"!$F$9\")*INDIRECT($B$1&\"!$C$20\")*B243))),\"\")","v":""},{"$f":"(INDIRECT($B$1&\"!$F$15\") -D243)/C243","v":{"$error":"#VALUE!"}},{"$f":"IF(ISNUMBER(E243),E243*INDIRECT($B$1&\"!$F$9\")/$G$3,\"\")","v":""},"",{"$f":"IF(B243<INDIRECT($B$1&\"!$C$7\"),H242-G243,\"\")","v":""}]
[null,{"$f":"IF(ISNUMBER(B243),IF(AND(B243<INDIRECT($B$1&\"!$C$7\"),H243>0), B243+0.5,\"\"),\"\")","v":""},"",{"$f":"IF(AND(B244<INDIRECT($B$1&\"!$C$7\"),ISNUMBER(B244)),INDIRECT($B$1&\"!$C$16\")*ERFC(0.5*C244*SQRT(INDIRECT($B$1&\"!$F$10\")/(INDIRECT($B$1&\"!$F$9\")*INDIRECT($B$1&\"!$C$20\")*B244))),\"\")","v":""},{"$f":"(INDIRECT($B$1&\"!$F$15\") -D244)/C244","v":{"$error":"#VALUE!"}},{"$f":"IF(ISNUMBER(E244),E244*INDIRECT($B$1&\"!$F$9\")/$G$3,\"\")","v":""},"",{"$f":"IF(B244<INDIRECT($B$1&\"!$C$7\"),H243-G244,\"\")","v":""}]
[null,{"$f":"IF(ISNUMBER(B244),IF(AND(B244<INDIRECT($B$1&\"!$C$7\"),H244>0), B244+0.5,\"\"),\"\")","v":""},"",{"$f":"IF(AND(B245<INDIRECT($B$1&\"!$C$7\"),ISNUMBER(B245)),INDIRECT($B$1&\"!$C$16\")*ERFC(0.5*C245*SQRT(INDIRECT($B$1&\"!$F$10\")/(INDIRECT($B$1&\"!$F$9\")*INDIRECT($B$1&\"!$C$20\")*B245))),\"\")","v":""},{"$f":"(INDIRECT($B$1&\"!$F$15\") -D245)/C245","v":{"$error":"#VALUE!"}},{"$f":"IF(ISNUMBER(E245),E245*INDIRECT($B$1&\"!$F$9\")/$G$3,\"\")","v":""},"",{"$f":"IF(B245<INDIRECT($B$1&\"!$C$7\"),H244-G245,\"\")","v":""}]
[null,{"$f":"IF(ISNUMBER(B245),IF(AND(B245<INDIRECT($B$1&\"!$C$7\"),H245>0), B245+0.5,\"\"),\"\")","v":""},"",{"$f":"IF(AND(B246<INDIRECT($B$1&\"!$C$7\"),ISNUMBER(B246)),INDIRECT($B$1&\"!$C$16\")*ERFC(0.5*C246*SQRT(INDIRECT($B$1&\"!$F$10\")/(INDIRECT($B$1&\"!$F$9\")*INDIRECT($B$1&\"!$C$20\")*B246))),\"\")","v":""},{"$f":"(INDIRECT($B$1&\"!$F$15\") -D246)/C246","v":{"$error":"#VALUE!"}},{"$f":"IF(ISNUMBER(E246),E246*INDIRECT($B$1&\"!$F$9\")/$G$3,\"\")","v":""},"",{"$f":"IF(B246<INDIRECT($B$1&\"!$C$7\"),H245-G246,\"\")","v":""}]
[null,{"$f":"IF(ISNUMBER(B246),IF(AND(B246<INDIRECT($B$1&\"!$C$7\"),H246>0), B246+0.5,\"\"),\"\")","v":""},"",{"$f":"IF(AND(B247<INDIRECT($B$1&\"!$C$7\"),ISNUMBER(B247)),INDIRECT($B$1&\"!$C$16\")*ERFC(0.5*C247*SQRT(INDIRECT($B$1&\"!$F$10\")/(INDIRECT($B$1&\"!$F$9\")*INDIRECT($B$1&\"!$C$20\")*B247))),\"\")","v":""},{"$f":"(INDIRECT($B$1&\"!$F$15\") -D247)/C247","v":{"$error":"#VALUE!"}},{"$f":"IF(ISNUMBER(E247),E247*INDIRECT($B$1&\"!$F$9\")/$G$3,\"\")","v":""},"",{"$f":"IF(B247<INDIRECT($B$1&\"!$C$7\"),H246-G247,\"\")","v":""}]
[null,{"$f":"IF(ISNUMBER(B247),IF(AND(B247<INDIRECT($B$1&\"!$C$7\"),H247>0), B247+0.5,\"\"),\"\")","v":""},"",{"$f":"IF(AND(B248<INDIRECT($B$1&\"!$C$7\"),ISNUMBER(B248)),INDIRECT($B$1&\"!$C$16\")*ERFC(0.5*C248*SQRT(INDIRECT($B$1&\"!$F$10\")/(INDIRECT($B$1&\"!$F$9\")*INDIRECT($B$1&\"!$C$20\")*B248))),\"\")","v":""},{"$f":"(INDIRECT($B$1&\"!$F$15\") -D248)/C248","v":{"$error":"#VALUE!"}},{"$f":"IF(ISNUMBER(E248),E248*INDIRECT($B$1&\"!$F$9\")/$G$3,\"\")","v":""},"",{"$f":"IF(B248<INDIRECT($B$1&\"!$C$7\"),H247-G248,\"\")","v":""}]
[null,{"$f":"IF(ISNUMBER(B248),IF(AND(B248<INDIRECT($B$1&\"!$C$7\"),H248>0), B248+0.5,\"\"),\"\")","v":""},"",{"$f":"IF(AND(B249<INDIRECT($B$1&\"!$C$7\"),ISNUMBER(B249)),INDIRECT($B$1&\"!$C$16\")*ERFC(0.5*C249*SQRT(INDIRECT($B$1&\"!$F$10\")/(INDIRECT($B$1&\"!$F$9\")*INDIRECT($B$1&\"!$C$20\")*B249))),\"\")","v":""},{"$f":"(INDIRECT($B$1&\"!$F$15\") -D249)/C249","v":{"$error":"#VALUE!"}},{"$f":"IF(ISNUMBER(E249),E249*INDIRECT($B$1&\"!$F$9\")/$G$3,\"\")","v":""},"",{"$f":"IF(B249<INDIRECT($B$1&\"!$C$7\"),H248-G249,\"\")","v":""}]
[null,{"$f":"IF(ISNUMBER(B249),IF(AND(B249<INDIRECT($B$1&\"!$C$7\"),H249>0), B249+0.5,\"\"),\"\")","v":""},"",{"$f":"IF(AND(B250<INDIRECT($B$1&\"!$C$7\"),ISNUMBER(B250)),INDIRECT($B$1&\"!$C$16\")*ERFC(0.5*C250*SQRT(INDIRECT($B$1&\"!$F$10\")/(INDIRECT($B$1&\"!$F$9\")*INDIRECT($B$1&\"!$C$20\")*B250))),\"\")","v":""},{"$f":"(INDIRECT($B$1&\"!$F$15\") -D250)/C250","v":{"$error":"#VALUE!"}},{"$f":"IF(ISNUMBER(E250),E250*INDIRECT($B$1&\"!$F$9\")/$G$3,\"\")","v":""},"",{"$f":"IF(B250<INDIRECT($B$1&\"!$C$7\"),H249-G250,\"\")","v":""}]
[null,{"$f":"IF(ISNUMBER(B250),IF(AND(B250<INDIRECT($B$1&\"!$C$7\"),H250>0), B250+0.5,\"\"),\"\")","v":""},"",{"$f":"IF(AND(B251<INDIRECT($B$1&\"!$C$7\"),ISNUMBER(B251)),INDIRECT($B$1&\"!$C$16\")*ERFC(0.5*C251*SQRT(INDIRECT($B$1&\"!$F$10\")/(INDIRECT($B$1&\"!$F$9\")*INDIRECT($B$1&\"!$C$20\")*B251))),\"\")","v":""},{"$f":"(INDIRECT($B$1&\"!$F$15\") -D251)/C251","v":{"$error":"#VALUE!"}},{"$f":"IF(ISNUMBER(E251),E251*INDIRECT($B$1&\"!$F$9\")/$G$3,\"\")","v":""},"",{"$f":"IF(B251<INDIRECT($B$1&\"!$C$7\"),H250-G251,\"\")","v":""}]
[null,{"$f":"IF(ISNUMBER(B251),IF(AND(B251<INDIRECT($B$1&\"!$C$7\"),H251>0), B251+0.5,\"\"),\"\")","v":""},"",{"$f":"IF(AND(B252<INDIRECT($B$1&\"!$C$7\"),ISNUMBER(B252)),INDIRECT($B$1&\"!$C$16\")*ERFC(0.5*C252*SQRT(INDIRECT($B$1&\"!$F$10\")/(INDIRECT($B$1&\"!$F$9\")*INDIRECT($B$1&\"!$C$20\")*B252))),\"\")","v":""},{"$f":"(INDIRECT($B$1&\"!$F$15\") -D252)/C252","v":{"$error":"#VALUE!"}},{"$f":"IF(ISNUMBER(E252),E252*INDIRECT($B$1&\"!$F$9\")/$G$3,\"\")","v":""},"",{"$f":"IF(B252<INDIRECT($B$1&\"!$C$7\"),H251-G252,\"\")","v":""}]
[null,{"$f":"IF(ISNUMBER(B252),IF(AND(B252<INDIRECT($B$1&\"!$C$7\"),H252>0), B252+0.5,\"\"),\"\")","v":""},"",{"$f":"IF(AND(B253<INDIRECT($B$1&\"!$C$7\"),ISNUMBER(B253)),INDIRECT($B$1&\"!$C$16\")*ERFC(0.5*C253*SQRT(INDIRECT($B$1&\"!$F$10\")/(INDIRECT($B$1&\"!$F$9\")*INDIRECT($B$1&\"!$C$20\")*B253))),\"\")","v":""},{"$f":"(INDIRECT($B$1&\"!$F$15\") -D253)/C253","v":{"$error":"#VALUE!"}},{"$f":"IF(ISNUMBER(E253),E253*INDIRECT($B$1&\"!$F$9\")/$G$3,\"\")","v":""},"",{"$f":"IF(B253<INDIRECT($B$1&\"!$C$7\"),H252-G253,\"\")","v":""}]
[null,{"$f":"IF(ISNUMBER(B253),IF(AND(B253<INDIRECT($B$1&\"!$C$7\"),H253>0), B253+0.5,\"\"),\"\")","v":""},"",{"$f":"IF(AND(B254<INDIRECT($B$1&\"!$C$7\"),ISNUMBER(B254)),INDIRECT($B$1&\"!$C$16\")*ERFC(0.5*C254*SQRT(INDIRECT($B$1&\"!$F$10\")/(INDIRECT($B$1&\"!$F$9\")*INDIRECT($B$1&\"!$C$20\")*B254))),\"\")","v":""},{"$f":"(INDIRECT($B$1&\"!$F$15\") -D254)/C254","v":{"$error":"#VALUE!"}},{"$f":"IF(ISNUMBER(E254),E254*INDIRECT($B$1&\"!$F$9\")/$G$3,\"\")","v":""},"",{"$f":"IF(B254<INDIRECT($B$1&\"!$C$7\"),H253-G254,\"\")","v":""}]
[null,{"$f":"IF(ISNUMBER(B254),IF(AND(B254<INDIRECT($B$1&\"!$C$7\"),H254>0), B254+0.5,\"\"),\"\")","v":""},"",{"$f":"IF(AND(B255<INDIRECT($B$1&\"!$C$7\"),ISNUMBER(B255)),INDIRECT($B$1&\"!$C$16\")*ERFC(0.5*C255*SQRT(INDIRECT($B$1&\"!$F$10\")/(INDIRECT($B$1&\"!$F$9\")*INDIRECT($B$1&\"!$C$20\")*B255))),\"\")","v":""},{"$f":"(INDIRECT($B$1&\"!$F$15\") -D255)/C255","v":{"$error":"#VALUE!"}},{"$f":"IF(ISNUMBER(E255),E255*INDIRECT($B$1&\"!$F$9\")/$G$3,\"\")","v":""},"",{"$f":"IF(B255<INDIRECT($B$1&\"!$C$7\"),H254-G255,\"\")","v":""}]
[null,{"$f":"IF(ISNUMBER(B255),IF(AND(B255<INDIRECT($B$1&\"!$C$7\"),H255>0), B255+0.5,\"\"),\"\")","v":""},"",{"$f":"IF(AND(B256<INDIRECT($B$1&\"!$C$7\"),ISNUMBER(B256)),INDIRECT($B$1&\"!$C$16\")*ERFC(0.5*C256*SQRT(INDIRECT($B$1&\"!$F$10\")/(INDIRECT($B$1&\"!$F$9\")*INDIRECT($B$1&\"!$C$20\")*B256))),\"\")","v":""},{"$f":"(INDIRECT($B$1&\"!$F$15\") -D256)/C256","v":{"$error":"#VALUE!"}},{"$f":"IF(ISNUMBER(E256),E256*INDIRECT($B$1&\"!$F$9\")/$G$3,\"\")","v":""},"",{"$f":"IF(B256<INDIRECT($B$1&\"!$C$7\"),H255-G256,\"\")","v":""}]
[null,{"$f":"IF(ISNUMBER(B256),IF(AND(B256<INDIRECT($B$1&\"!$C$7\"),H256>0), B256+0.5,\"\"),\"\")","v":""},"",{"$f":"IF(AND(B257<INDIRECT($B$1&\"!$C$7\"),ISNUMBER(B257)),INDIRECT($B$1&\"!$C$16\")*ERFC(0.5*C257*SQRT(INDIRECT($B$1&\"!$F$10\")/(INDIRECT($B$1&\"!$F$9\")*INDIRECT($B$1&\"!$C$20\")*B257))),\"\")","v":""},{"$f":"(INDIRECT($B$1&\"!$F$15\") -D257)/C257","v":{"$error":"#VALUE!"}},{"$f":"IF(ISNUMBER(E257),E257*INDIRECT($B$1&\"!$F$9\")/$G$3,\"\")","v":""},"",{"$f":"IF(B257<INDIRECT($B$1&\"!$C$7\"),H256-G257,\"\")","v":""}]
[null,{"$f":"IF(ISNUMBER(B257),IF(AND(B257<INDIRECT($B$1&\"!$C$7\"),H257>0), B257+0.5,\"\"),\"\")","v":""},"",{"$f":"IF(AND(B258<INDIRECT($B$1&\"!$C$7\"),ISNUMBER(B258)),INDIRECT($B$1&\"!$C$16\")*ERFC(0.5*C258*SQRT(INDIRECT($B$1&\"!$F$10\")/(INDIRECT($B$1&\"!$F$9\")*INDIRECT($B$1&\"!$C$20\")*B258))),\"\")","v":""},{"$f":"(INDIRECT($B$1&\"!$F$15\") -D258)/C258","v":{"$error":"#VALUE!"}},{"$f":"IF(ISNUMBER(E258),E258*INDIRECT($B$1&\"!$F$9\")/$G$3,\"\")","v":""},"",{"$f":"IF(B258<INDIRECT($B$1&\"!$C$7\"),H257-G258,\"\")","v":""}]
[null,{"$f":"IF(ISNUMBER(B258),IF(AND(B258<INDIRECT($B$1&\"!$C$7\"),H258>0), B258+0.5,\"\"),\"\")","v":""},"",{"$f":"IF(AND(B259<INDIRECT($B$1&\"!$C$7\"),ISNUMBER(B259)),INDIRECT($B$1&\"!$C$16\")*ERFC(0.5*C259*SQRT(INDIRECT($B$1&\"!$F$10\")/(INDIRECT($B$1&\"!$F$9\")*INDIRECT($B$1&\"!$C$20\")*B259))),\"\")","v":""},{"$f":"(INDIRECT($B$1&\"!$F$15\") -D259)/C259","v":{"$error":"#VALUE!"}},{"$f":"IF(ISNUMBER(E259),E259*INDIRECT($B$1&\"!$F$9\")/$G$3,\"\")","v":""},"",{"$f":"IF(B259<INDIRECT($B$1&\"!$C$7\"),H258-G259,\"\")","v":""}]
[null,{"$f":"IF(ISNUMBER(B259),IF(AND(B259<INDIRECT($B$1&\"!$C$7\"),H259>0), B259+0.5,\"\"),\"\")","v":""},"",{"$f":"IF(AND(B260<INDIRECT($B$1&\"!$C$7\"),ISNUMBER(B260)),INDIRECT($B$1&\"!$C$16\")*ERFC(0.5*C260*SQRT(INDIRECT($B$1&\"!$F$10\")/(INDIRECT($B$1&\"!$F$9\")*INDIRECT($B$1&\"!$C$20\")*B260))),\"\")","v":""},{"$f":"(INDIRECT($B$1&\"!$F$15\") -D260)/C260","v":{"$error":"#VALUE!"}},{"$f":"IF(ISNUMBER(E260),E260*INDIRECT($B$1&\"!$F$9\")/$G$3,\"\")","v":""},"",{"$f":"IF(B260<INDIRECT($B$1&\"!$C$7\"),H259-G260,\"\")","v":""}]
[null,{"$f":"IF(ISNUMBER(B260),IF(AND(B260<INDIRECT($B$1&\"!$C$7\"),H260>0), B260+0.5,\"\"),\"\")","v":""},"",{"$f":"IF(AND(B261<INDIRECT($B$1&\"!$C$7\"),ISNUMBER(B261)),INDIRECT($B$1&\"!$C$16\")*ERFC(0.5*C261*SQRT(INDIRECT($B$1&\"!$F$10\")/(INDIRECT($B$1&\"!$F$9\")*INDIRECT($B$1&\"!$C$20\")*B261))),\"\")","v":""},{"$f":"(INDIRECT($B$1&\"!$F$15\") -D261)/C261","v":{"$error":"#VALUE!"}},{"$f":"IF(ISNUMBER(E261),E261*INDIRECT($B$1&\"!$F$9\")/$G$3,\"\")","v":""},"",{"$f":"IF(B261<INDIRECT($B$1&\"!$C$7\"),H260-G261,\"\")","v":""}]
[null,{"$f":"IF(ISNUMBER(B261),IF(AND(B261<INDIRECT($B$1&\"!$C$7\"),H261>0), B261+0.5,\"\"),\"\")","v":""},"",{"$f":"IF(AND(B262<INDIRECT($B$1&\"!$C$7\"),ISNUMBER(B262)),INDIRECT($B$1&\"!$C$16\")*ERFC(0.5*C262*SQRT(INDIRECT($B$1&\"!$F$10\")/(INDIRECT($B$1&\"!$F$9\")*INDIRECT($B$1&\"!$C$20\")*B262))),\"\")","v":""},{"$f":"(INDIRECT($B$1&\"!$F$15\") -D262)/C262","v":{"$error":"#VALUE!"}},{"$f":"IF(ISNUMBER(E262),E262*INDIRECT($B$1&\"!$F$9\")/$G$3,\"\")","v":""},"",{"$f":"IF(B262<INDIRECT($B$1&\"!$C$7\"),H261-G262,\"\")","v":""}]
[null,{"$f":"IF(ISNUMBER(B262),IF(AND(B262<INDIRECT($B$1&\"!$C$7\"),H262>0), B262+0.5,\"\"),\"\")","v":""},"",{"$f":"IF(AND(B263<INDIRECT($B$1&\"!$C$7\"),ISNUMBER(B263)),INDIRECT($B$1&\"!$C$16\")*ERFC(0.5*C263*SQRT(INDIRECT($B$1&\"!$F$10\")/(INDIRECT($B$1&\"!$F$9\")*INDIRECT($B$1&\"!$C$20\")*B263))),\"\")","v":""},{"$f":"(INDIRECT($B$1&\"!$F$15\") -D263)/C263","v":{"$error":"#VALUE!"}},{"$f":"IF(ISNUMBER(E263),E263*INDIRECT($B$1&\"!$F$9\")/$G$3,\"\")","v":""},"",{"$f":"IF(B263<INDIRECT($B$1&\"!$C$7\"),H262-G263,\"\")","v":""}]
[null,{"$f":"IF(ISNUMBER(B263),IF(AND(B263<INDIRECT($B$1&\"!$C$7\"),H263>0), B263+0.5,\"\"),\"\")","v":""},"",{"$f":"IF(AND(B264<INDIRECT($B$1&\"!$C$7\"),ISNUMBER(B264)),INDIRECT($B$1&\"!$C$16\")*ERFC(0.5*C264*SQRT(INDIRECT($B$1&\"!$F$10\")/(INDIRECT($B$1&\"!$F$9\")*INDIRECT($B$1&\"!$C$20\")*B264))),\"\")","v":""},{"$f":"(INDIRECT($B$1&\"!$F$15\") -D264)/C264","v":{"$error":"#VALUE!"}},{"$f":"IF(ISNUMBER(E264),E264*INDIRECT($B$1&\"!$F$9\")/$G$3,\"\")","v":""},"",{"$f":"IF(B264<INDIRECT($B$1&\"!$C$7\"),H263-G264,\"\")","v":""}]
[null,{"$f":"IF(ISNUMBER(B264),IF(AND(B264<INDIRECT($B$1&\"!$C$7\"),H264>0), B264+0.5,\"\"),\"\")","v":""},"",{"$f":"IF(AND(B265<INDIRECT($B$1&\"!$C$7\"),ISNUMBER(B265)),INDIRECT($B$1&\"!$C$16\")*ERFC(0.5*C265*SQRT(INDIRECT($B$1&\"!$F$10\")/(INDIRECT($B$1&\"!$F$9\")*INDIRECT($B$1&\"!$C$20\")*B265))),\"\")","v":""},{"$f":"(INDIRECT($B$1&\"!$F$15\") -D265)/C265","v":{"$error":"#VALUE!"}},{"$f":"IF(ISNUMBER(E265),E265*INDIRECT($B$1&\"!$F$9\")/$G$3,\"\")","v":""},"",{"$f":"IF(B265<INDIRECT($B$1&\"!$C$7\"),H264-G265,\"\")","v":""}]
[null,{"$f":"IF(ISNUMBER(B265),IF(AND(B265<INDIRECT($B$1&\"!$C$7\"),H265>0), B265+0.5,\"\"),\"\")","v":""},"",{"$f":"IF(AND(B266<INDIRECT($B$1&\"!$C$7\"),ISNUMBER(B266)),INDIRECT($B$1&\"!$C$16\")*ERFC(0.5*C266*SQRT(INDIRECT($B$1&\"!$F$10\")/(INDIRECT($B$1&\"!$F$9\")*INDIRECT($B$1&\"!$C$20\")*B266))),\"\")","v":""},{"$f":"(INDIRECT($B$1&\"!$F$15\") -D266)/C266","v":{"$error":"#VALUE!"}},{"$f":"IF(ISNUMBER(E266),E266*INDIRECT($B$1&\"!$F$9\")/$G$3,\"\")","v":""},"",{"$f":"IF(B266<INDIRECT($B$1&\"!$C$7\"),H265-G266,\"\")","v":""}]
[null,{"$f":"IF(ISNUMBER(B266),IF(AND(B266<INDIRECT($B$1&\"!$C$7\"),H266>0), B266+0.5,\"\"),\"\")","v":""},"",{"$f":"IF(AND(B267<INDIRECT($B$1&\"!$C$7\"),ISNUMBER(B267)),INDIRECT($B$1&\"!$C$16\")*ERFC(0.5*C267*SQRT(INDIRECT($B$1&\"!$F$10\")/(INDIRECT($B$1&\"!$F$9\")*INDIRECT($B$1&\"!$C$20\")*B267))),\"\")","v":""},{"$f":"(INDIRECT($B$1&\"!$F$15\") -D267)/C267","v":{"$error":"#VALUE!"}},{"$f":"IF(ISNUMBER(E267),E267*INDIRECT($B$1&\"!$F$9\")/$G$3,\"\")","v":""},"",{"$f":"IF(B267<INDIRECT($B$1&\"!$C$7\"),H266-G267,\"\")","v":""}]
[null,{"$f":"IF(ISNUMBER(B267),IF(AND(B267<INDIRECT($B$1&\"!$C$7\"),H267>0), B267+0.5,\"\"),\"\")","v":""},"",{"$f":"IF(AND(B268<INDIRECT($B$1&\"!$C$7\"),ISNUMBER(B268)),INDIRECT($B$1&\"!$C$16\")*ERFC(0.5*C268*SQRT(INDIRECT($B$1&\"!$F$10\")/(INDIRECT($B$1&\"!$F$9\")*INDIRECT($B$1&\"!$C$20\")*B268))),\"\")","v":""},{"$f":"(INDIRECT($B$1&\"!$F$15\") -D268)/C268","v":{"$error":"#VALUE!"}},{"$f":"IF(ISNUMBER(E268),E268*INDIRECT($B$1&\"!$F$9\")/$G$3,\"\")","v":""},"",{"$f":"IF(B268<INDIRECT($B$1&\"!$C$7\"),H267-G268,\"\")","v":""}]
[null,{"$f":"IF(ISNUMBER(B268),IF(AND(B268<INDIRECT($B$1&\"!$C$7\"),H268>0), B268+0.5,\"\"),\"\")","v":""},"",{"$f":"IF(AND(B269<INDIRECT($B$1&\"!$C$7\"),ISNUMBER(B269)),INDIRECT($B$1&\"!$C$16\")*ERFC(0.5*C269*SQRT(INDIRECT($B$1&\"!$F$10\")/(INDIRECT($B$1&\"!$F$9\")*INDIRECT($B$1&\"!$C$20\")*B269))),\"\")","v":""},{"$f":"(INDIRECT($B$1&\"!$F$15\") -D269)/C269","v":{"$error":"#VALUE!"}},{"$f":"IF(ISNUMBER(E269),E269*INDIRECT($B$1&\"!$F$9\")/$G$3,\"\")","v":""},"",{"$f":"IF(B269<INDIRECT($B$1&\"!$C$7\"),H268-G269,\"\")","v":""}]
[null,{"$f":"IF(ISNUMBER(B269),IF(AND(B269<INDIRECT($B$1&\"!$C$7\"),H269>0), B269+0.5,\"\"),\"\")","v":""},"",{"$f":"IF(AND(B270<INDIRECT($B$1&\"!$C$7\"),ISNUMBER(B270)),INDIRECT($B$1&\"!$C$16\")*ERFC(0.5*C270*SQRT(INDIRECT($B$1&\"!$F$10\")/(INDIRECT($B$1&\"!$F$9\")*INDIRECT($B$1&\"!$C$20\")*B270))),\"\")","v":""},{"$f":"(INDIRECT($B$1&\"!$F$15\") -D270)/C270","v":{"$error":"#VALUE!"}},{"$f":"IF(ISNUMBER(E270),E270*INDIRECT($B$1&\"!$F$9\")/$G$3,\"\")","v":""},"",{"$f":"IF(B270<INDIRECT($B$1&\"!$C$7\"),H269-G270,\"\")","v":""}]
[null,{"$f":"IF(ISNUMBER(B270),IF(AND(B270<INDIRECT($B$1&\"!$C$7\"),H270>0), B270+0.5,\"\"),\"\")","v":""},"",{"$f":"IF(AND(B271<INDIRECT($B$1&\"!$C$7\"),ISNUMBER(B271)),INDIRECT($B$1&\"!$C$16\")*ERFC(0.5*C271*SQRT(INDIRECT($B$1&\"!$F$10\")/(INDIRECT($B$1&\"!$F$9\")*INDIRECT($B$1&\"!$C$20\")*B271))),\"\")","v":""},{"$f":"(INDIRECT($B$1&\"!$F$15\") -D271)/C271","v":{"$error":"#VALUE!"}},{"$f":"IF(ISNUMBER(E271),E271*INDIRECT($B$1&\"!$F$9\")/$G$3,\"\")","v":""},"",{"$f":"IF(B271<INDIRECT($B$1&\"!$C$7\"),H270-G271,\"\")","v":""}]
[null,{"$f":"IF(ISNUMBER(B271),IF(AND(B271<INDIRECT($B$1&\"!$C$7\"),H271>0), B271+0.5,\"\"),\"\")","v":""},"",{"$f":"IF(AND(B272<INDIRECT($B$1&\"!$C$7\"),ISNUMBER(B272)),INDIRECT($B$1&\"!$C$16\")*ERFC(0.5*C272*SQRT(INDIRECT($B$1&\"!$F$10\")/(INDIRECT($B$1&\"!$F$9\")*INDIRECT($B$1&\"!$C$20\")*B272))),\"\")","v":""},{"$f":"(INDIRECT($B$1&\"!$F$15\") -D272)/C272","v":{"$error":"#VALUE!"}},{"$f":"IF(ISNUMBER(E272),E272*INDIRECT($B$1&\"!$F$9\")/$G$3,\"\")","v":""},"",{"$f":"IF(B272<INDIRECT($B$1&\"!$C$7\"),H271-G272,\"\")","v":""}]
[null,{"$f":"IF(ISNUMBER(B272),IF(AND(B272<INDIRECT($B$1&\"!$C$7\"),H272>0), B272+0.5,\"\"),\"\")","v":""},"",{"$f":"IF(AND(B273<INDIRECT($B$1&\"!$C$7\"),ISNUMBER(B273)),INDIRECT($B$1&\"!$C$16\")*ERFC(0.5*C273*SQRT(INDIRECT($B$1&\"!$F$10\")/(INDIRECT($B$1&\"!$F$9\")*INDIRECT($B$1&\"!$C$20\")*B273))),\"\")","v":""},{"$f":"(INDIRECT($B$1&\"!$F$15\") -D273)/C273","v":{"$error":"#VALUE!"}},{"$f":"IF(ISNUMBER(E273),E273*INDIRECT($B$1&\"!$F$9\")/$G$3,\"\")","v":""},"",{"$f":"IF(B273<INDIRECT($B$1&\"!$C$7\"),H272-G273,\"\")","v":""}]
[null,{"$f":"IF(ISNUMBER(B273),IF(AND(B273<INDIRECT($B$1&\"!$C$7\"),H273>0), B273+0.5,\"\"),\"\")","v":""},"",{"$f":"IF(AND(B274<INDIRECT($B$1&\"!$C$7\"),ISNUMBER(B274)),INDIRECT($B$1&\"!$C$16\")*ERFC(0.5*C274*SQRT(INDIRECT($B$1&\"!$F$10\")/(INDIRECT($B$1&\"!$F$9\")*INDIRECT($B$1&\"!$C$20\")*B274))),\"\")","v":""},{"$f":"(INDIRECT($B$1&\"!$F$15\") -D274)/C274","v":{"$error":"#VALUE!"}},{"$f":"IF(ISNUMBER(E274),E274*INDIRECT($B$1&\"!$F$9\")/$G$3,\"\")","v":""},"",{"$f":"IF(B274<INDIRECT($B$1&\"!$C$7\"),H273-G274,\"\")","v":""}]
[null,{"$f":"IF(ISNUMBER(B274),IF(AND(B274<INDIRECT($B$1&\"!$C$7\"),H274>0), B274+0.5,\"\"),\"\")","v":""},"",{"$f":"IF(AND(B275<INDIRECT($B$1&\"!$C$7\"),ISNUMBER(B275)),INDIRECT($B$1&\"!$C$16\")*ERFC(0.5*C275*SQRT(INDIRECT($B$1&\"!$F$10\")/(INDIRECT($B$1&\"!$F$9\")*INDIRECT($B$1&\"!$C$20\")*B275))),\"\")","v":""},{"$f":"(INDIRECT($B$1&\"!$F$15\") -D275)/C275","v":{"$error":"#VALUE!"}},{"$f":"IF(ISNUMBER(E275),E275*INDIRECT($B$1&\"!$F$9\")/$G$3,\"\")","v":""},"",{"$f":"IF(B275<INDIRECT($B$1&\"!$C$7\"),H274-G275,\"\")","v":""}]
[null,{"$f":"IF(ISNUMBER(B275),IF(AND(B275<INDIRECT($B$1&\"!$C$7\"),H275>0), B275+0.5,\"\"),\"\")","v":""},"",{"$f":"IF(AND(B276<INDIRECT($B$1&\"!$C$7\"),ISNUMBER(B276)),INDIRECT($B$1&\"!$C$16\")*ERFC(0.5*C276*SQRT(INDIRECT($B$1&\"!$F$10\")/(INDIRECT($B$1&\"!$F$9\")*INDIRECT($B$1&\"!$C$20\")*B276))),\"\")","v":""},{"$f":"(INDIRECT($B$1&\"!$F$15\") -D276)/C276","v":{"$error":"#VALUE!"}},{"$f":"IF(ISNUMBER(E276),E276*INDIRECT($B$1&\"!$F$9\")/$G$3,\"\")","v":""},"",{"$f":"IF(B276<INDIRECT($B$1&\"!$C$7\"),H275-G276,\"\")","v":""}]
[null,{"$f":"IF(ISNUMBER(B276),IF(AND(B276<INDIRECT($B$1&\"!$C$7\"),H276>0), B276+0.5,\"\"),\"\")","v":""},"",{"$f":"IF(AND(B277<INDIRECT($B$1&\"!$C$7\"),ISNUMBER(B277)),INDIRECT($B$1&\"!$C$16\")*ERFC(0.5*C277*SQRT(INDIRECT($B$1&\"!$F$10\")/(INDIRECT($B$1&\"!$F$9\")*INDIRECT($B$1&\"!$C$20\")*B277))),\"\")","v":""},{"$f":"(INDIRECT($B$1&\"!$F$15\") -D277)/C277","v":{"$error":"#VALUE!"}},{"$f":"IF(ISNUMBER(E277),E277*INDIRECT($B$1&\"!$F$9\")/$G$3,\"\")","v":""},"",{"$f":"IF(B277<INDIRECT($B$1&\"!$C$7\"),H276-G277,\"\")","v":""}]
[null,{"$f":"IF(ISNUMBER(B277),IF(AND(B277<INDIRECT($B$1&\"!$C$7\"),H277>0), B277+0.5,\"\"),\"\")","v":""},"",{"$f":"IF(AND(B278<INDIRECT($B$1&\"!$C$7\"),ISNUMBER(B278)),INDIRECT($B$1&\"!$C$16\")*ERFC(0.5*C278*SQRT(INDIRECT($B$1&\"!$F$10\")/(INDIRECT($B$1&\"!$F$9\")*INDIRECT($B$1&\"!$C$20\")*B278))),\"\")","v":""},{"$f":"(INDIRECT($B$1&\"!$F$15\") -D278)/C278","v":{"$error":"#VALUE!"}},{"$f":"IF(ISNUMBER(E278),E278*INDIRECT($B$1&\"!$F$9\")/$G$3,\"\")","v":""},"",{"$f":"IF(B278<INDIRECT($B$1&\"!$C$7\"),H277-G278,\"\")","v":""}]
[null,{"$f":"IF(ISNUMBER(B278),IF(AND(B278<INDIRECT($B$1&\"!$C$7\"),H278>0), B278+0.5,\"\"),\"\")","v":""},"",{"$f":"IF(AND(B279<INDIRECT($B$1&\"!$C$7\"),ISNUMBER(B279)),INDIRECT($B$1&\"!$C$16\")*ERFC(0.5*C279*SQRT(INDIRECT($B$1&\"!$F$10\")/(INDIRECT($B$1&\"!$F$9\")*INDIRECT($B$1&\"!$C$20\")*B279))),\"\")","v":""},{"$f":"(INDIRECT($B$1&\"!$F$15\") -D279)/C279","v":{"$error":"#VALUE!"}},{"$f":"IF(ISNUMBER(E279),E279*INDIRECT($B$1&\"!$F$9\")/$G$3,\"\")","v":""},"",{"$f":"IF(B279<INDIRECT($B$1&\"!$C$7\"),H278-G279,\"\")","v":""}]
[null,{"$f":"IF(ISNUMBER(B279),IF(AND(B279<INDIRECT($B$1&\"!$C$7\"),H279>0), B279+0.5,\"\"),\"\")","v":""},"",{"$f":"IF(AND(B280<INDIRECT($B$1&\"!$C$7\"),ISNUMBER(B280)),INDIRECT($B$1&\"!$C$16\")*ERFC(0.5*C280*SQRT(INDIRECT($B$1&\"!$F$10\")/(INDIRECT($B$1&\"!$F$9\")*INDIRECT($B$1&\"!$C$20\")*B280))),\"\")","v":""},{"$f":"(INDIRECT($B$1&\"!$F$15\") -D280)/C280","v":{"$error":"#VALUE!"}},{"$f":"IF(ISNUMBER(E280),E280*INDIRECT($B$1&\"!$F$9\")/$G$3,\"\")","v":""},"",{"$f":"IF(B280<INDIRECT($B$1&\"!$C$7\"),H279-G280,\"\")","v":""}]
[null,{"$f":"IF(ISNUMBER(B280),IF(AND(B280<INDIRECT($B$1&\"!$C$7\"),H280>0), B280+0.5,\"\"),\"\")","v":""},"",{"$f":"IF(AND(B281<INDIRECT($B$1&\"!$C$7\"),ISNUMBER(B281)),INDIRECT($B$1&\"!$C$16\")*ERFC(0.5*C281*SQRT(INDIRECT($B$1&\"!$F$10\")/(INDIRECT($B$1&\"!$F$9\")*INDIRECT($B$1&\"!$C$20\")*B281))),\"\")","v":""},{"$f":"(INDIRECT($B$1&\"!$F$15\") -D281)/C281","v":{"$error":"#VALUE!"}},{"$f":"IF(ISNUMBER(E281),E281*INDIRECT($B$1&\"!$F$9\")/$G$3,\"\")","v":""},"",{"$f":"IF(B281<INDIRECT($B$1&\"!$C$7\"),H280-G281,\"\")","v":""}]
[null,{"$f":"IF(ISNUMBER(B281),IF(AND(B281<INDIRECT($B$1&\"!$C$7\"),H281>0), B281+0.5,\"\"),\"\")","v":""},"",{"$f":"IF(AND(B282<INDIRECT($B$1&\"!$C$7\"),ISNUMBER(B282)),INDIRECT($B$1&\"!$C$16\")*ERFC(0.5*C282*SQRT(INDIRECT($B$1&\"!$F$10\")/(INDIRECT($B$1&\"!$F$9\")*INDIRECT($B$1&\"!$C$20\")*B282))),\"\")","v":""},{"$f":"(INDIRECT($B$1&\"!$F$15\") -D282)/C282","v":{"$error":"#VALUE!"}},{"$f":"IF(ISNUMBER(E282),E282*INDIRECT($B$1&\"!$F$9\")/$G$3,\"\")","v":""},"",{"$f":"IF(B282<INDIRECT($B$1&\"!$C$7\"),H281-G282,\"\")","v":""}]
[null,{"$f":"IF(ISNUMBER(B282),IF(AND(B282<INDIRECT($B$1&\"!$C$7\"),H282>0), B282+0.5,\"\"),\"\")","v":""},"",{"$f":"IF(AND(B283<INDIRECT($B$1&\"!$C$7\"),ISNUMBER(B283)),INDIRECT($B$1&\"!$C$16\")*ERFC(0.5*C283*SQRT(INDIRECT($B$1&\"!$F$10\")/(INDIRECT($B$1&\"!$F$9\")*INDIRECT($B$1&\"!$C$20\")*B283))),\"\")","v":""},{"$f":"(INDIRECT($B$1&\"!$F$15\") -D283)/C283","v":{"$error":"#VALUE!"}},{"$f":"IF(ISNUMBER(E283),E283*INDIRECT($B$1&\"!$F$9\")/$G$3,\"\")","v":""},"",{"$f":"IF(B283<INDIRECT($B$1&\"!$C$7\"),H282-G283,\"\")","v":""}]
[null,{"$f":"IF(ISNUMBER(B283),IF(AND(B283<INDIRECT($B$1&\"!$C$7\"),H283>0), B283+0.5,\"\"),\"\")","v":""},"",{"$f":"IF(AND(B284<INDIRECT($B$1&\"!$C$7\"),ISNUMBER(B284)),INDIRECT($B$1&\"!$C$16\")*ERFC(0.5*C284*SQRT(INDIRECT($B$1&\"!$F$10\")/(INDIRECT($B$1&\"!$F$9\")*INDIRECT($B$1&\"!$C$20\")*B284))),\"\")","v":""},{"$f":"(INDIRECT($B$1&\"!$F$15\") -D284)/C284","v":{"$error":"#VALUE!"}},{"$f":"IF(ISNUMBER(E284),E284*INDIRECT($B$1&\"!$F$9\")/$G$3,\"\")","v":""},"",{"$f":"IF(B284<INDIRECT($B$1&\"!$C$7\"),H283-G284,\"\")","v":""}]
[null,{"$f":"IF(ISNUMBER(B284),IF(AND(B284<INDIRECT($B$1&\"!$C$7\"),H284>0), B284+0.5,\"\"),\"\")","v":""},"",{"$f":"IF(AND(B285<INDIRECT($B$1&\"!$C$7\"),ISNUMBER(B285)),INDIRECT($B$1&\"!$C$16\")*ERFC(0.5*C285*SQRT(INDIRECT($B$1&\"!$F$10\")/(INDIRECT($B$1&\"!$F$9\")*INDIRECT($B$1&\"!$C$20\")*B285))),\"\")","v":""},{"$f":"(INDIRECT($B$1&\"!$F$15\") -D285)/C285","v":{"$error":"#VALUE!"}},{"$f":"IF(ISNUMBER(E285),E285*INDIRECT($B$1&\"!$F$9\")/$G$3,\"\")","v":""},"",{"$f":"IF(B285<INDIRECT($B$1&\"!$C$7\"),H284-G285,\"\")","v":""}]
[null,{"$f":"IF(ISNUMBER(B285),IF(AND(B285<INDIRECT($B$1&\"!$C$7\"),H285>0), B285+0.5,\"\"),\"\")","v":""},"",{"$f":"IF(AND(B286<INDIRECT($B$1&\"!$C$7\"),ISNUMBER(B286)),INDIRECT($B$1&\"!$C$16\")*ERFC(0.5*C286*SQRT(INDIRECT($B$1&\"!$F$10\")/(INDIRECT($B$1&\"!$F$9\")*INDIRECT($B$1&\"!$C$20\")*B286))),\"\")","v":""},{"$f":"(INDIRECT($B$1&\"!$F$15\") -D286)/C286","v":{"$error":"#VALUE!"}},{"$f":"IF(ISNUMBER(E286),E286*INDIRECT($B$1&\"!$F$9\")/$G$3,\"\")","v":""},"",{"$f":"IF(B286<INDIRECT($B$1&\"!$C$7\"),H285-G286,\"\")","v":""}]
[null,{"$f":"IF(ISNUMBER(B286),IF(AND(B286<INDIRECT($B$1&\"!$C$7\"),H286>0), B286+0.5,\"\"),\"\")","v":""},"",{"$f":"IF(AND(B287<INDIRECT($B$1&\"!$C$7\"),ISNUMBER(B287)),INDIRECT($B$1&\"!$C$16\")*ERFC(0.5*C287*SQRT(INDIRECT($B$1&\"!$F$10\")/(INDIRECT($B$1&\"!$F$9\")*INDIRECT($B$1&\"!$C$20\")*B287))),\"\")","v":""},{"$f":"(INDIRECT($B$1&\"!$F$15\") -D287)/C287","v":{"$error":"#VALUE!"}},{"$f":"IF(ISNUMBER(E287),E287*INDIRECT($B$1&\"!$F$9\")/$G$3,\"\")","v":""},"",{"$f":"IF(B287<INDIRECT($B$1&\"!$C$7\"),H286-G287,\"\")","v":""}]
[null,{"$f":"IF(ISNUMBER(B287),IF(AND(B287<INDIRECT($B$1&\"!$C$7\"),H287>0), B287+0.5,\"\"),\"\")","v":""},"",{"$f":"IF(AND(B288<INDIRECT($B$1&\"!$C$7\"),ISNUMBER(B288)),INDIRECT($B$1&\"!$C$16\")*ERFC(0.5*C288*SQRT(INDIRECT($B$1&\"!$F$10\")/(INDIRECT($B$1&\"!$F$9\")*INDIRECT($B$1&\"!$C$20\")*B288))),\"\")","v":""},{"$f":"(INDIRECT($B$1&\"!$F$15\") -D288)/C288","v":{"$error":"#VALUE!"}},{"$f":"IF(ISNUMBER(E288),E288*INDIRECT($B$1&\"!$F$9\")/$G$3,\"\")","v":""},"",{"$f":"IF(B288<INDIRECT($B$1&\"!$C$7\"),H287-G288,\"\")","v":""}]
[null,{"$f":"IF(ISNUMBER(B288),IF(AND(B288<INDIRECT($B$1&\"!$C$7\"),H288>0), B288+0.5,\"\"),\"\")","v":""},"",{"$f":"IF(AND(B289<INDIRECT($B$1&\"!$C$7\"),ISNUMBER(B289)),INDIRECT($B$1&\"!$C$16\")*ERFC(0.5*C289*SQRT(INDIRECT($B$1&\"!$F$10\")/(INDIRECT($B$1&\"!$F$9\")*INDIRECT($B$1&\"!$C$20\")*B289))),\"\")","v":""},{"$f":"(INDIRECT($B$1&\"!$F$15\") -D289)/C289","v":{"$error":"#VALUE!"}},{"$f":"IF(ISNUMBER(E289),E289*INDIRECT($B$1&\"!$F$9\")/$G$3,\"\")","v":""},"",{"$f":"IF(B289<INDIRECT($B$1&\"!$C$7\"),H288-G289,\"\")","v":""}]
[null,{"$f":"IF(ISNUMBER(B289),IF(AND(B289<INDIRECT($B$1&\"!$C$7\"),H289>0), B289+0.5,\"\"),\"\")","v":""},"",{"$f":"IF(AND(B290<INDIRECT($B$1&\"!$C$7\"),ISNUMBER(B290)),INDIRECT($B$1&\"!$C$16\")*ERFC(0.5*C290*SQRT(INDIRECT($B$1&\"!$F$10\")/(INDIRECT($B$1&\"!$F$9\")*INDIRECT($B$1&\"!$C$20\")*B290))),\"\")","v":""},{"$f":"(INDIRECT($B$1&\"!$F$15\") -D290)/C290","v":{"$error":"#VALUE!"}},{"$f":"IF(ISNUMBER(E290),E290*INDIRECT($B$1&\"!$F$9\")/$G$3,\"\")","v":""},"",{"$f":"IF(B290<INDIRECT($B$1&\"!$C$7\"),H289-G290,\"\")","v":""}]
[null,{"$f":"IF(ISNUMBER(B290),IF(AND(B290<INDIRECT($B$1&\"!$C$7\"),H290>0), B290+0.5,\"\"),\"\")","v":""},"",{"$f":"IF(AND(B291<INDIRECT($B$1&\"!$C$7\"),ISNUMBER(B291)),INDIRECT($B$1&\"!$C$16\")*ERFC(0.5*C291*SQRT(INDIRECT($B$1&\"!$F$10\")/(INDIRECT($B$1&\"!$F$9\")*INDIRECT($B$1&\"!$C$20\")*B291))),\"\")","v":""},{"$f":"(INDIRECT($B$1&\"!$F$15\") -D291)/C291","v":{"$error":"#VALUE!"}},{"$f":"IF(ISNUMBER(E291),E291*INDIRECT($B$1&\"!$F$9\")/$G$3,\"\")","v":""},"",{"$f":"IF(B291<INDIRECT($B$1&\"!$C$7\"),H290-G291,\"\")","v":""}]
[null,{"$f":"IF(ISNUMBER(B291),IF(AND(B291<INDIRECT($B$1&\"!$C$7\"),H291>0), B291+0.5,\"\"),\"\")","v":""},"",{"$f":"IF(AND(B292<INDIRECT($B$1&\"!$C$7\"),ISNUMBER(B292)),INDIRECT($B$1&\"!$C$16\")*ERFC(0.5*C292*SQRT(INDIRECT($B$1&\"!$F$10\")/(INDIRECT($B$1&\"!$F$9\")*INDIRECT($B$1&\"!$C$20\")*B292))),\"\")","v":""},{"$f":"(INDIRECT($B$1&\"!$F$15\") -D292)/C292","v":{"$error":"#VALUE!"}},{"$f":"IF(ISNUMBER(E292),E292*INDIRECT($B$1&\"!$F$9\")/$G$3,\"\")","v":""},"",{"$f":"IF(B292<INDIRECT($B$1&\"!$C$7\"),H291-G292,\"\")","v":""}]
[null,{"$f":"IF(ISNUMBER(B292),IF(AND(B292<INDIRECT($B$1&\"!$C$7\"),H292>0), B292+0.5,\"\"),\"\")","v":""},"",{"$f":"IF(AND(B293<INDIRECT($B$1&\"!$C$7\"),ISNUMBER(B293)),INDIRECT($B$1&\"!$C$16\")*ERFC(0.5*C293*SQRT(INDIRECT($B$1&\"!$F$10\")/(INDIRECT($B$1&\"!$F$9\")*INDIRECT($B$1&\"!$C$20\")*B293))),\"\")","v":""},{"$f":"(INDIRECT($B$1&\"!$F$15\") -D293)/C293","v":{"$error":"#VALUE!"}},{"$f":"IF(ISNUMBER(E293),E293*INDIRECT($B$1&\"!$F$9\")/$G$3,\"\")","v":""},"",{"$f":"IF(B293<INDIRECT($B$1&\"!$C$7\"),H292-G293,\"\")","v":""}]
[null,{"$f":"IF(ISNUMBER(B293),IF(AND(B293<INDIRECT($B$1&\"!$C$7\"),H293>0), B293+0.5,\"\"),\"\")","v":""},"",{"$f":"IF(AND(B294<INDIRECT($B$1&\"!$C$7\"),ISNUMBER(B294)),INDIRECT($B$1&\"!$C$16\")*ERFC(0.5*C294*SQRT(INDIRECT($B$1&\"!$F$10\")/(INDIRECT($B$1&\"!$F$9\")*INDIRECT($B$1&\"!$C$20\")*B294))),\"\")","v":""},{"$f":"(INDIRECT($B$1&\"!$F$15\") -D294)/C294","v":{"$error":"#VALUE!"}},{"$f":"IF(ISNUMBER(E294),E294*INDIRECT($B$1&\"!$F$9\")/$G$3,\"\")","v":""},"",{"$f":"IF(B294<INDIRECT($B$1&\"!$C$7\"),H293-G294,\"\")","v":""}]
[null,{"$f":"IF(ISNUMBER(B294),IF(AND(B294<INDIRECT($B$1&\"!$C$7\"),H294>0), B294+0.5,\"\"),\"\")","v":""},"",{"$f":"IF(AND(B295<INDIRECT($B$1&\"!$C$7\"),ISNUMBER(B295)),INDIRECT($B$1&\"!$C$16\")*ERFC(0.5*C295*SQRT(INDIRECT($B$1&\"!$F$10\")/(INDIRECT($B$1&\"!$F$9\")*INDIRECT($B$1&\"!$C$20\")*B295))),\"\")","v":""},{"$f":"(INDIRECT($B$1&\"!$F$15\") -D295)/C295","v":{"$error":"#VALUE!"}},{"$f":"IF(ISNUMBER(E295),E295*INDIRECT($B$1&\"!$F$9\")/$G$3,\"\")","v":""},"",{"$f":"IF(B295<INDIRECT($B$1&\"!$C$7\"),H294-G295,\"\")","v":""}]
[null,{"$f":"IF(ISNUMBER(B295),IF(AND(B295<INDIRECT($B$1&\"!$C$7\"),H295>0), B295+0.5,\"\"),\"\")","v":""},"",{"$f":"IF(AND(B296<INDIRECT($B$1&\"!$C$7\"),ISNUMBER(B296)),INDIRECT($B$1&\"!$C$16\")*ERFC(0.5*C296*SQRT(INDIRECT($B$1&\"!$F$10\")/(INDIRECT($B$1&\"!$F$9\")*INDIRECT($B$1&\"!$C$20\")*B296))),\"\")","v":""},{"$f":"(INDIRECT($B$1&\"!$F$15\") -D296)/C296","v":{"$error":"#VALUE!"}},{"$f":"IF(ISNUMBER(E296),E296*INDIRECT($B$1&\"!$F$9\")/$G$3,\"\")","v":""},"",{"$f":"IF(B296<INDIRECT($B$1&\"!$C$7\"),H295-G296,\"\")","v":""}]
[null,{"$f":"IF(ISNUMBER(B296),IF(AND(B296<INDIRECT($B$1&\"!$C$7\"),H296>0), B296+0.5,\"\"),\"\")","v":""},"",{"$f":"IF(AND(B297<INDIRECT($B$1&\"!$C$7\"),ISNUMBER(B297)),INDIRECT($B$1&\"!$C$16\")*ERFC(0.5*C297*SQRT(INDIRECT($B$1&\"!$F$10\")/(INDIRECT($B$1&\"!$F$9\")*INDIRECT($B$1&\"!$C$20\")*B297))),\"\")","v":""},{"$f":"(INDIRECT($B$1&\"!$F$15\") -D297)/C297","v":{"$error":"#VALUE!"}},{"$f":"IF(ISNUMBER(E297),E297*INDIRECT($B$1&\"!$F$9\")/$G$3,\"\")","v":""},"",{"$f":"IF(B297<INDIRECT($B$1&\"!$C$7\"),H296-G297,\"\")","v":""}]
[null,{"$f":"IF(ISNUMBER(B297),IF(AND(B297<INDIRECT($B$1&\"!$C$7\"),H297>0), B297+0.5,\"\"),\"\")","v":""},"",{"$f":"IF(AND(B298<INDIRECT($B$1&\"!$C$7\"),ISNUMBER(B298)),INDIRECT($B$1&\"!$C$16\")*ERFC(0.5*C298*SQRT(INDIRECT($B$1&\"!$F$10\")/(INDIRECT($B$1&\"!$F$9\")*INDIRECT($B$1&\"!$C$20\")*B298))),\"\")","v":""},{"$f":"(INDIRECT($B$1&\"!$F$15\") -D298)/C298","v":{"$error":"#VALUE!"}},{"$f":"IF(ISNUMBER(E298),E298*INDIRECT($B$1&\"!$F$9\")/$G$3,\"\")","v":""},"",{"$f":"IF(B298<INDIRECT($B$1&\"!$C$7\"),H297-G298,\"\")","v":""}]
[null,{"$f":"IF(ISNUMBER(B298),IF(AND(B298<INDIRECT($B$1&\"!$C$7\"),H298>0), B298+0.5,\"\"),\"\")","v":""},"",{"$f":"IF(AND(B299<INDIRECT($B$1&\"!$C$7\"),ISNUMBER(B299)),INDIRECT($B$1&\"!$C$16\")*ERFC(0.5*C299*SQRT(INDIRECT($B$1&\"!$F$10\")/(INDIRECT($B$1&\"!$F$9\")*INDIRECT($B$1&\"!$C$20\")*B299))),\"\")","v":""},{"$f":"(INDIRECT($B$1&\"!$F$15\") -D299)/C299","v":{"$error":"#VALUE!"}},{"$f":"IF(ISNUMBER(E299),E299*INDIRECT($B$1&\"!$F$9\")/$G$3,\"\")","v":""},"",{"$f":"IF(B299<INDIRECT($B$1&\"!$C$7\"),H298-G299,\"\")","v":""}]
[null,{"$f":"IF(ISNUMBER(B299),IF(AND(B299<INDIRECT($B$1&\"!$C$7\"),H299>0), B299+0.5,\"\"),\"\")","v":""},"",{"$f":"IF(AND(B300<INDIRECT($B$1&\"!$C$7\"),ISNUMBER(B300)),INDIRECT($B$1&\"!$C$16\")*ERFC(0.5*C300*SQRT(INDIRECT($B$1&\"!$F$10\")/(INDIRECT($B$1&\"!$F$9\")*INDIRECT($B$1&\"!$C$20\")*B300))),\"\")","v":""},{"$f":"(INDIRECT($B$1&\"!$F$15\") -D300)/C300","v":{"$error":"#VALUE!"}},{"$f":"IF(ISNUMBER(E300),E300*INDIRECT($B$1&\"!$F$9\")/$G$3,\"\")","v":""},"",{"$f":"IF(B300<INDIRECT($B$1&\"!$C$7\"),H299-G300,\"\")","v":""}]
[null,{"$f":"IF(ISNUMBER(B300),IF(AND(B300<INDIRECT($B$1&\"!$C$7\"),H300>0), B300+0.5,\"\"),\"\")","v":""},"",{"$f":"IF(AND(B301<INDIRECT($B$1&\"!$C$7\"),ISNUMBER(B301)),INDIRECT($B$1&\"!$C$16\")*ERFC(0.5*C301*SQRT(INDIRECT($B$1&\"!$F$10\")/(INDIRECT($B$1&\"!$F$9\")*INDIRECT($B$1&\"!$C$20\")*B301))),\"\")","v":""},{"$f":"(INDIRECT($B$1&\"!$F$15\") -D301)/C301","v":{"$error":"#VALUE!"}},{"$f":"IF(ISNUMBER(E301),E301*INDIRECT($B$1&\"!$F$9\")/$G$3,\"\")","v":""},"",{"$f":"IF(B301<INDIRECT($B$1&\"!$C$7\"),H300-G301,\"\")","v":""}]
[null,{"$f":"IF(ISNUMBER(B301),IF(AND(B301<INDIRECT($B$1&\"!$C$7\"),H301>0), B301+0.5,\"\"),\"\")","v":""},"",{"$f":"IF(AND(B302<INDIRECT($B$1&\"!$C$7\"),ISNUMBER(B302)),INDIRECT($B$1&\"!$C$16\")*ERFC(0.5*C302*SQRT(INDIRECT($B$1&\"!$F$10\")/(INDIRECT($B$1&\"!$F$9\")*INDIRECT($B$1&\"!$C$20\")*B302))),\"\")","v":""},{"$f":"(INDIRECT($B$1&\"!$F$15\") -D302)/C302","v":{"$error":"#VALUE!"}},{"$f":"IF(ISNUMBER(E302),E302*INDIRECT($B$1&\"!$F$9\")/$G$3,\"\")","v":""},"",{"$f":"IF(B302<INDIRECT($B$1&\"!$C$7\"),H301-G302,\"\")","v":""}]
[null,{"$f":"IF(ISNUMBER(B302),IF(AND(B302<INDIRECT($B$1&\"!$C$7\"),H302>0), B302+0.5,\"\"),\"\")","v":""},"",{"$f":"IF(AND(B303<INDIRECT($B$1&\"!$C$7\"),ISNUMBER(B303)),INDIRECT($B$1&\"!$C$16\")*ERFC(0.5*C303*SQRT(INDIRECT($B$1&\"!$F$10\")/(INDIRECT($B$1&\"!$F$9\")*INDIRECT($B$1&\"!$C$20\")*B303))),\"\")","v":""},{"$f":"(INDIRECT($B$1&\"!$F$15\") -D303)/C303","v":{"$error":"#VALUE!"}},{"$f":"IF(ISNUMBER(E303),E303*INDIRECT($B$1&\"!$F$9\")/$G$3,\"\")","v":""},"",{"$f":"IF(B303<INDIRECT($B$1&\"!$C$7\"),H302-G303,\"\")","v":""}]
[null,{"$f":"IF(ISNUMBER(B303),IF(AND(B303<INDIRECT($B$1&\"!$C$7\"),H303>0), B303+0.5,\"\"),\"\")","v":""},"",{"$f":"IF(AND(B304<INDIRECT($B$1&\"!$C$7\"),ISNUMBER(B304)),INDIRECT($B$1&\"!$C$16\")*ERFC(0.5*C304*SQRT(INDIRECT($B$1&\"!$F$10\")/(INDIRECT($B$1&\"!$F$9\")*INDIRECT($B$1&\"!$C$20\")*B304))),\"\")","v":""},{"$f":"(INDIRECT($B$1&\"!$F$15\") -D304)/C304","v":{"$error":"#VALUE!"}},{"$f":"IF(ISNUMBER(E304),E304*INDIRECT($B$1&\"!$F$9\")/$G$3,\"\")","v":""},"",{"$f":"IF(B304<INDIRECT($B$1&\"!$C$7\"),H303-G304,\"\")","v":""}]
[null,{"$f":"IF(ISNUMBER(B304),IF(AND(B304<INDIRECT($B$1&\"!$C$7\"),H304>0), B304+0.5,\"\"),\"\")","v":""},{"$f":"IF(ISNUMBER(B305),H304,\"\")","v":""},{"$f":"IF(AND(B305<INDIRECT($B$1&\"!$C$7\"),ISNUMBER(B305)),INDIRECT($B$1&\"!$C$16\")*ERFC(0.5*C305*SQRT(INDIRECT($B$1&\"!$F$10\")/(INDIRECT($B$1&\"!$F$9\")*INDIRECT($B$1&\"!$C$20\")*B305))),\"\")","v":""},{"$f":"(INDIRECT($B$1&\"!$F$15\") -D305)/C305","v":{"$error":"#VALUE!"}},{"$f":"IF(ISNUMBER(E305),E305*INDIRECT($B$1&\"!$F$9\")/$G$3,\"\")","v":""},{"$f":"IF(ISNUMBER(F305),F305*ABS(B304-B305)/$I$3,\"\")","v":""},{"$f":"IF(B305<INDIRECT($B$1&\"!$C$7\"),H304-G305,\"\")","v":""}]
[null,{"$f":"IF(ISNUMBER(B305),IF(AND(B305<INDIRECT($B$1&\"!$C$7\"),H305>0), B305+0.5,\"\"),\"\")","v":""},"",{"$f":"IF(AND(B306<INDIRECT($B$1&\"!$C$7\"),ISNUMBER(B306)),INDIRECT($B$1&\"!$C$16\")*ERFC(0.5*C306*SQRT(INDIRECT($B$1&\"!$F$10\")/(INDIRECT($B$1&\"!$F$9\")*INDIRECT($B$1&\"!$C$20\")*B306))),\"\")","v":""},{"$f":"(INDIRECT($B$1&\"!$F$15\") -D306)/C306","v":{"$error":"#VALUE!"}},{"$f":"IF(ISNUMBER(E306),E306*INDIRECT($B$1&\"!$F$9\")/$G$3,\"\")","v":""},"",{"$f":"IF(B306<INDIRECT($B$1&\"!$C$7\"),H305-G306,\"\")","v":""}]
[null,{"$f":"IF(ISNUMBER(B306),IF(AND(B306<INDIRECT($B$1&\"!$C$7\"),H306>0), B306+0.5,\"\"),\"\")","v":""},"",{"$f":"IF(AND(B307<INDIRECT($B$1&\"!$C$7\"),ISNUMBER(B307)),INDIRECT($B$1&\"!$C$16\")*ERFC(0.5*C307*SQRT(INDIRECT($B$1&\"!$F$10\")/(INDIRECT($B$1&\"!$F$9\")*INDIRECT($B$1&\"!$C$20\")*B307))),\"\")","v":""},{"$f":"(INDIRECT($B$1&\"!$F$15\") -D307)/C307","v":{"$error":"#VALUE!"}},{"$f":"IF(ISNUMBER(E307),E307*INDIRECT($B$1&\"!$F$9\")/$G$3,\"\")","v":""},"",{"$f":"IF(B307<INDIRECT($B$1&\"!$C$7\"),H306-G307,\"\")","v":""}]
[null,{"$f":"IF(ISNUMBER(B307),IF(AND(B307<INDIRECT($B$1&\"!$C$7\"),H307>0), B307+0.5,\"\"),\"\")","v":""},"",{"$f":"IF(AND(B308<INDIRECT($B$1&\"!$C$7\"),ISNUMBER(B308)),INDIRECT($B$1&\"!$C$16\")*ERFC(0.5*C308*SQRT(INDIRECT($B$1&\"!$F$10\")/(INDIRECT($B$1&\"!$F$9\")*INDIRECT($B$1&\"!$C$20\")*B308))),\"\")","v":""},{"$f":"(INDIRECT($B$1&\"!$F$15\") -D308)/C308","v":{"$error":"#VALUE!"}},{"$f":"IF(ISNUMBER(E308),E308*INDIRECT($B$1&\"!$F$9\")/$G$3,\"\")","v":""},"",{"$f":"IF(B308<INDIRECT($B$1&\"!$C$7\"),H307-G308,\"\")","v":""}]
[null,{"$f":"IF(ISNUMBER(B308),IF(AND(B308<INDIRECT($B$1&\"!$C$7\"),H308>0), B308+0.5,\"\"),\"\")","v":""},"",{"$f":"IF(AND(B309<INDIRECT($B$1&\"!$C$7\"),ISNUMBER(B309)),INDIRECT($B$1&\"!$C$16\")*ERFC(0.5*C309*SQRT(INDIRECT($B$1&\"!$F$10\")/(INDIRECT($B$1&\"!$F$9\")*INDIRECT($B$1&\"!$C$20\")*B309))),\"\")","v":""},{"$f":"(INDIRECT($B$1&\"!$F$15\") -D309)/C309","v":{"$error":"#VALUE!"}},{"$f":"IF(ISNUMBER(E309),E309*INDIRECT($B$1&\"!$F$9\")/$G$3,\"\")","v":""},"",{"$f":"IF(B309<INDIRECT($B$1&\"!$C$7\"),H308-G309,\"\")","v":""}]
[null,{"$f":"IF(ISNUMBER(B309),IF(AND(B309<INDIRECT($B$1&\"!$C$7\"),H309>0), B309+0.5,\"\"),\"\")","v":""},"",{"$f":"IF(AND(B310<INDIRECT($B$1&\"!$C$7\"),ISNUMBER(B310)),INDIRECT($B$1&\"!$C$16\")*ERFC(0.5*C310*SQRT(INDIRECT($B$1&\"!$F$10\")/(INDIRECT($B$1&\"!$F$9\")*INDIRECT($B$1&\"!$C$20\")*B310))),\"\")","v":""},{"$f":"(INDIRECT($B$1&\"!$F$15\") -D310)/C310","v":{"$error":"#VALUE!"}},{"$f":"IF(ISNUMBER(E310),E310*INDIRECT($B$1&\"!$F$9\")/$G$3,\"\")","v":""},"",{"$f":"IF(B310<INDIRECT($B$1&\"!$C$7\"),H309-G310,\"\")","v":""}]
[null,{"$f":"IF(ISNUMBER(B310),IF(AND(B310<INDIRECT($B$1&\"!$C$7\"),H310>0), B310+0.5,\"\"),\"\")","v":""},"",{"$f":"IF(AND(B311<INDIRECT($B$1&\"!$C$7\"),ISNUMBER(B311)),INDIRECT($B$1&\"!$C$16\")*ERFC(0.5*C311*SQRT(INDIRECT($B$1&\"!$F$10\")/(INDIRECT($B$1&\"!$F$9\")*INDIRECT($B$1&\"!$C$20\")*B311))),\"\")","v":""},{"$f":"(INDIRECT($B$1&\"!$F$15\") -D311)/C311","v":{"$error":"#VALUE!"}},{"$f":"IF(ISNUMBER(E311),E311*INDIRECT($B$1&\"!$F$9\")/$G$3,\"\")","v":""},"",{"$f":"IF(B311<INDIRECT($B$1&\"!$C$7\"),H310-G311,\"\")","v":""}]
[null,{"$f":"IF(ISNUMBER(B311),IF(AND(B311<INDIRECT($B$1&\"!$C$7\"),H311>0), B311+0.5,\"\"),\"\")","v":""},"",{"$f":"IF(AND(B312<INDIRECT($B$1&\"!$C$7\"),ISNUMBER(B312)),INDIRECT($B$1&\"!$C$16\")*ERFC(0.5*C312*SQRT(INDIRECT($B$1&\"!$F$10\")/(INDIRECT($B$1&\"!$F$9\")*INDIRECT($B$1&\"!$C$20\")*B312))),\"\")","v":""},{"$f":"(INDIRECT($B$1&\"!$F$15\") -D312)/C312","v":{"$error":"#VALUE!"}},{"$f":"IF(ISNUMBER(E312),E312*INDIRECT($B$1&\"!$F$9\")/$G$3,\"\")","v":""},"",{"$f":"IF(B312<INDIRECT($B$1&\"!$C$7\"),H311-G312,\"\")","v":""}]
[null,{"$f":"IF(ISNUMBER(B312),IF(AND(B312<INDIRECT($B$1&\"!$C$7\"),H312>0), B312+0.5,\"\"),\"\")","v":""},"",{"$f":"IF(AND(B313<INDIRECT($B$1&\"!$C$7\"),ISNUMBER(B313)),INDIRECT($B$1&\"!$C$16\")*ERFC(0.5*C313*SQRT(INDIRECT($B$1&\"!$F$10\")/(INDIRECT($B$1&\"!$F$9\")*INDIRECT($B$1&\"!$C$20\")*B313))),\"\")","v":""},{"$f":"(INDIRECT($B$1&\"!$F$15\") -D313)/C313","v":{"$error":"#VALUE!"}},{"$f":"IF(ISNUMBER(E313),E313*INDIRECT($B$1&\"!$F$9\")/$G$3,\"\")","v":""},"",{"$f":"IF(B313<INDIRECT($B$1&\"!$C$7\"),H312-G313,\"\")","v":""}]
[null,{"$f":"IF(ISNUMBER(B313),IF(AND(B313<INDIRECT($B$1&\"!$C$7\"),H313>0), B313+0.5,\"\"),\"\")","v":""},"",{"$f":"IF(AND(B314<INDIRECT($B$1&\"!$C$7\"),ISNUMBER(B314)),INDIRECT($B$1&\"!$C$16\")*ERFC(0.5*C314*SQRT(INDIRECT($B$1&\"!$F$10\")/(INDIRECT($B$1&\"!$F$9\")*INDIRECT($B$1&\"!$C$20\")*B314))),\"\")","v":""},{"$f":"(INDIRECT($B$1&\"!$F$15\") -D314)/C314","v":{"$error":"#VALUE!"}},{"$f":"IF(ISNUMBER(E314),E314*INDIRECT($B$1&\"!$F$9\")/$G$3,\"\")","v":""},"",{"$f":"IF(B314<INDIRECT($B$1&\"!$C$7\"),H313-G314,\"\")","v":""}]
[null,{"$f":"IF(ISNUMBER(B314),IF(AND(B314<INDIRECT($B$1&\"!$C$7\"),H314>0), B314+0.5,\"\"),\"\")","v":""},"",{"$f":"IF(AND(B315<INDIRECT($B$1&\"!$C$7\"),ISNUMBER(B315)),INDIRECT($B$1&\"!$C$16\")*ERFC(0.5*C315*SQRT(INDIRECT($B$1&\"!$F$10\")/(INDIRECT($B$1&\"!$F$9\")*INDIRECT($B$1&\"!$C$20\")*B315))),\"\")","v":""},{"$f":"(INDIRECT($B$1&\"!$F$15\") -D315)/C315","v":{"$error":"#VALUE!"}},{"$f":"IF(ISNUMBER(E315),E315*INDIRECT($B$1&\"!$F$9\")/$G$3,\"\")","v":""},"",{"$f":"IF(B315<INDIRECT($B$1&\"!$C$7\"),H314-G315,\"\")","v":""}]
[null,{"$f":"IF(ISNUMBER(B315),IF(AND(B315<INDIRECT($B$1&\"!$C$7\"),H315>0), B315+0.5,\"\"),\"\")","v":""},"",{"$f":"IF(AND(B316<INDIRECT($B$1&\"!$C$7\"),ISNUMBER(B316)),INDIRECT($B$1&\"!$C$16\")*ERFC(0.5*C316*SQRT(INDIRECT($B$1&\"!$F$10\")/(INDIRECT($B$1&\"!$F$9\")*INDIRECT($B$1&\"!$C$20\")*B316))),\"\")","v":""},{"$f":"(INDIRECT($B$1&\"!$F$15\") -D316)/C316","v":{"$error":"#VALUE!"}},{"$f":"IF(ISNUMBER(E316),E316*INDIRECT($B$1&\"!$F$9\")/$G$3,\"\")","v":""},"",{"$f":"IF(B316<INDIRECT($B$1&\"!$C$7\"),H315-G316,\"\")","v":""}]
[null,{"$f":"IF(ISNUMBER(B316),IF(AND(B316<INDIRECT($B$1&\"!$C$7\"),H316>0), B316+0.5,\"\"),\"\")","v":""},"",{"$f":"IF(AND(B317<INDIRECT($B$1&\"!$C$7\"),ISNUMBER(B317)),INDIRECT($B$1&\"!$C$16\")*ERFC(0.5*C317*SQRT(INDIRECT($B$1&\"!$F$10\")/(INDIRECT($B$1&\"!$F$9\")*INDIRECT($B$1&\"!$C$20\")*B317))),\"\")","v":""},{"$f":"(INDIRECT($B$1&\"!$F$15\") -D317)/C317","v":{"$error":"#VALUE!"}},{"$f":"IF(ISNUMBER(E317),E317*INDIRECT($B$1&\"!$F$9\")/$G$3,\"\")","v":""},"",{"$f":"IF(B317<INDIRECT($B$1&\"!$C$7\"),H316-G317,\"\")","v":""}]
[null,{"$f":"IF(ISNUMBER(B317),IF(AND(B317<INDIRECT($B$1&\"!$C$7\"),H317>0), B317+0.5,\"\"),\"\")","v":""},"",{"$f":"IF(AND(B318<INDIRECT($B$1&\"!$C$7\"),ISNUMBER(B318)),INDIRECT($B$1&\"!$C$16\")*ERFC(0.5*C318*SQRT(INDIRECT($B$1&\"!$F$10\")/(INDIRECT($B$1&\"!$F$9\")*INDIRECT($B$1&\"!$C$20\")*B318))),\"\")","v":""},{"$f":"(INDIRECT($B$1&\"!$F$15\") -D318)/C318","v":{"$error":"#VALUE!"}},{"$f":"IF(ISNUMBER(E318),E318*INDIRECT($B$1&\"!$F$9\")/$G$3,\"\")","v":""},"",{"$f":"IF(B318<INDIRECT($B$1&\"!$C$7\"),H317-G318,\"\")","v":""}]
[null,{"$f":"IF(ISNUMBER(B318),IF(AND(B318<INDIRECT($B$1&\"!$C$7\"),H318>0), B318+0.5,\"\"),\"\")","v":""},"",{"$f":"IF(AND(B319<INDIRECT($B$1&\"!$C$7\"),ISNUMBER(B319)),INDIRECT($B$1&\"!$C$16\")*ERFC(0.5*C319*SQRT(INDIRECT($B$1&\"!$F$10\")/(INDIRECT($B$1&\"!$F$9\")*INDIRECT($B$1&\"!$C$20\")*B319))),\"\")","v":""},{"$f":"(INDIRECT($B$1&\"!$F$15\") -D319)/C319","v":{"$error":"#VALUE!"}},{"$f":"IF(ISNUMBER(E319),E319*INDIRECT($B$1&\"!$F$9\")/$G$3,\"\")","v":""},"",{"$f":"IF(B319<INDIRECT($B$1&\"!$C$7\"),H318-G319,\"\")","v":""}]
[null,{"$f":"IF(ISNUMBER(B319),IF(AND(B319<INDIRECT($B$1&\"!$C$7\"),H319>0), B319+0.5,\"\"),\"\")","v":""},"",{"$f":"IF(AND(B320<INDIRECT($B$1&\"!$C$7\"),ISNUMBER(B320)),INDIRECT($B$1&\"!$C$16\")*ERFC(0.5*C320*SQRT(INDIRECT($B$1&\"!$F$10\")/(INDIRECT($B$1&\"!$F$9\")*INDIRECT($B$1&\"!$C$20\")*B320))),\"\")","v":""},{"$f":"(INDIRECT($B$1&\"!$F$15\") -D320)/C320","v":{"$error":"#VALUE!"}},{"$f":"IF(ISNUMBER(E320),E320*INDIRECT($B$1&\"!$F$9\")/$G$3,\"\")","v":""},"",{"$f":"IF(B320<INDIRECT($B$1&\"!$C$7\"),H319-G320,\"\")","v":""}]
[null,{"$f":"IF(ISNUMBER(B320),IF(AND(B320<INDIRECT($B$1&\"!$C$7\"),H320>0), B320+0.5,\"\"),\"\")","v":""},"",{"$f":"IF(AND(B321<INDIRECT($B$1&\"!$C$7\"),ISNUMBER(B321)),INDIRECT($B$1&\"!$C$16\")*ERFC(0.5*C321*SQRT(INDIRECT($B$1&\"!$F$10\")/(INDIRECT($B$1&\"!$F$9\")*INDIRECT($B$1&\"!$C$20\")*B321))),\"\")","v":""},{"$f":"(INDIRECT($B$1&\"!$F$15\") -D321)/C321","v":{"$error":"#VALUE!"}},{"$f":"IF(ISNUMBER(E321),E321*INDIRECT($B$1&\"!$F$9\")/$G$3,\"\")","v":""},"",{"$f":"IF(B321<INDIRECT($B$1&\"!$C$7\"),H320-G321,\"\")","v":""}]
[null,{"$f":"IF(ISNUMBER(B321),IF(AND(B321<INDIRECT($B$1&\"!$C$7\"),H321>0), B321+0.5,\"\"),\"\")","v":""},"",{"$f":"IF(AND(B322<INDIRECT($B$1&\"!$C$7\"),ISNUMBER(B322)),INDIRECT($B$1&\"!$C$16\")*ERFC(0.5*C322*SQRT(INDIRECT($B$1&\"!$F$10\")/(INDIRECT($B$1&\"!$F$9\")*INDIRECT($B$1&\"!$C$20\")*B322))),\"\")","v":""},{"$f":"(INDIRECT($B$1&\"!$F$15\") -D322)/C322","v":{"$error":"#VALUE!"}},{"$f":"IF(ISNUMBER(E322),E322*INDIRECT($B$1&\"!$F$9\")/$G$3,\"\")","v":""},"",{"$f":"IF(B322<INDIRECT($B$1&\"!$C$7\"),H321-G322,\"\")","v":""}]
[null,{"$f":"IF(ISNUMBER(B322),IF(AND(B322<INDIRECT($B$1&\"!$C$7\"),H322>0), B322+0.5,\"\"),\"\")","v":""},"",{"$f":"IF(AND(B323<INDIRECT($B$1&\"!$C$7\"),ISNUMBER(B323)),INDIRECT($B$1&\"!$C$16\")*ERFC(0.5*C323*SQRT(INDIRECT($B$1&\"!$F$10\")/(INDIRECT($B$1&\"!$F$9\")*INDIRECT($B$1&\"!$C$20\")*B323))),\"\")","v":""},{"$f":"(INDIRECT($B$1&\"!$F$15\") -D323)/C323","v":{"$error":"#VALUE!"}},{"$f":"IF(ISNUMBER(E323),E323*INDIRECT($B$1&\"!$F$9\")/$G$3,\"\")","v":""},"",{"$f":"IF(B323<INDIRECT($B$1&\"!$C$7\"),H322-G323,\"\")","v":""}]
[null,{"$f":"IF(ISNUMBER(B323),IF(AND(B323<INDIRECT($B$1&\"!$C$7\"),H323>0), B323+0.5,\"\"),\"\")","v":""},"",{"$f":"IF(AND(B324<INDIRECT($B$1&\"!$C$7\"),ISNUMBER(B324)),INDIRECT($B$1&\"!$C$16\")*ERFC(0.5*C324*SQRT(INDIRECT($B$1&\"!$F$10\")/(INDIRECT($B$1&\"!$F$9\")*INDIRECT($B$1&\"!$C$20\")*B324))),\"\")","v":""},{"$f":"(INDIRECT($B$1&\"!$F$15\") -D324)/C324","v":{"$error":"#VALUE!"}},{"$f":"IF(ISNUMBER(E324),E324*INDIRECT($B$1&\"!$F$9\")/$G$3,\"\")","v":""},"",{"$f":"IF(B324<INDIRECT($B$1&\"!$C$7\"),H323-G324,\"\")","v":""}]
[null,{"$f":"IF(ISNUMBER(B324),IF(AND(B324<INDIRECT($B$1&\"!$C$7\"),H324>0), B324+0.5,\"\"),\"\")","v":""},"",{"$f":"IF(AND(B325<INDIRECT($B$1&\"!$C$7\"),ISNUMBER(B325)),INDIRECT($B$1&\"!$C$16\")*ERFC(0.5*C325*SQRT(INDIRECT($B$1&\"!$F$10\")/(INDIRECT($B$1&\"!$F$9\")*INDIRECT($B$1&\"!$C$20\")*B325))),\"\")","v":""},{"$f":"(INDIRECT($B$1&\"!$F$15\") -D325)/C325","v":{"$error":"#VALUE!"}},{"$f":"IF(ISNUMBER(E325),E325*INDIRECT($B$1&\"!$F$9\")/$G$3,\"\")","v":""},"",{"$f":"IF(B325<INDIRECT($B$1&\"!$C$7\"),H324-G325,\"\")","v":""}]
[null,{"$f":"IF(ISNUMBER(B325),IF(AND(B325<INDIRECT($B$1&\"!$C$7\"),H325>0), B325+0.5,\"\"),\"\")","v":""},"",{"$f":"IF(AND(B326<INDIRECT($B$1&\"!$C$7\"),ISNUMBER(B326)),INDIRECT($B$1&\"!$C$16\")*ERFC(0.5*C326*SQRT(INDIRECT($B$1&\"!$F$10\")/(INDIRECT($B$1&\"!$F$9\")*INDIRECT($B$1&\"!$C$20\")*B326))),\"\")","v":""},{"$f":"(INDIRECT($B$1&\"!$F$15\") -D326)/C326","v":{"$error":"#VALUE!"}},{"$f":"IF(ISNUMBER(E326),E326*INDIRECT($B$1&\"!$F$9\")/$G$3,\"\")","v":""},"",{"$f":"IF(B326<INDIRECT($B$1&\"!$C$7\"),H325-G326,\"\")","v":""}]
[null,{"$f":"IF(ISNUMBER(B326),IF(AND(B326<INDIRECT($B$1&\"!$C$7\"),H326>0), B326+0.5,\"\"),\"\")","v":""},"",{"$f":"IF(AND(B327<INDIRECT($B$1&\"!$C$7\"),ISNUMBER(B327)),INDIRECT($B$1&\"!$C$16\")*ERFC(0.5*C327*SQRT(INDIRECT($B$1&\"!$F$10\")/(INDIRECT($B$1&\"!$F$9\")*INDIRECT($B$1&\"!$C$20\")*B327))),\"\")","v":""},{"$f":"(INDIRECT($B$1&\"!$F$15\") -D327)/C327","v":{"$error":"#VALUE!"}},{"$f":"IF(ISNUMBER(E327),E327*INDIRECT($B$1&\"!$F$9\")/$G$3,\"\")","v":""},"",{"$f":"IF(B327<INDIRECT($B$1&\"!$C$7\"),H326-G327,\"\")","v":""}]
[null,{"$f":"IF(ISNUMBER(B327),IF(AND(B327<INDIRECT($B$1&\"!$C$7\"),H327>0), B327+0.5,\"\"),\"\")","v":""},"",{"$f":"IF(AND(B328<INDIRECT($B$1&\"!$C$7\"),ISNUMBER(B328)),INDIRECT($B$1&\"!$C$16\")*ERFC(0.5*C328*SQRT(INDIRECT($B$1&\"!$F$10\")/(INDIRECT($B$1&\"!$F$9\")*INDIRECT($B$1&\"!$C$20\")*B328))),\"\")","v":""},{"$f":"(INDIRECT($B$1&\"!$F$15\") -D328)/C328","v":{"$error":"#VALUE!"}},{"$f":"IF(ISNUMBER(E328),E328*INDIRECT($B$1&\"!$F$9\")/$G$3,\"\")","v":""},"",{"$f":"IF(B328<INDIRECT($B$1&\"!$C$7\"),H327-G328,\"\")","v":""}]
[null,{"$f":"IF(ISNUMBER(B328),IF(AND(B328<INDIRECT($B$1&\"!$C$7\"),H328>0), B328+0.5,\"\"),\"\")","v":""},"",{"$f":"IF(AND(B329<INDIRECT($B$1&\"!$C$7\"),ISNUMBER(B329)),INDIRECT($B$1&\"!$C$16\")*ERFC(0.5*C329*SQRT(INDIRECT($B$1&\"!$F$10\")/(INDIRECT($B$1&\"!$F$9\")*INDIRECT($B$1&\"!$C$20\")*B329))),\"\")","v":""},{"$f":"(INDIRECT($B$1&\"!$F$15\") -D329)/C329","v":{"$error":"#VALUE!"}},{"$f":"IF(ISNUMBER(E329),E329*INDIRECT($B$1&\"!$F$9\")/$G$3,\"\")","v":""},"",{"$f":"IF(B329<INDIRECT($B$1&\"!$C$7\"),H328-G329,\"\")","v":""}]
[null,{"$f":"IF(ISNUMBER(B329),IF(AND(B329<INDIRECT($B$1&\"!$C$7\"),H329>0), B329+0.5,\"\"),\"\")","v":""},"",{"$f":"IF(AND(B330<INDIRECT($B$1&\"!$C$7\"),ISNUMBER(B330)),INDIRECT($B$1&\"!$C$16\")*ERFC(0.5*C330*SQRT(INDIRECT($B$1&\"!$F$10\")/(INDIRECT($B$1&\"!$F$9\")*INDIRECT($B$1&\"!$C$20\")*B330))),\"\")","v":""},{"$f":"(INDIRECT($B$1&\"!$F$15\") -D330)/C330","v":{"$error":"#VALUE!"}},{"$f":"IF(ISNUMBER(E330),E330*INDIRECT($B$1&\"!$F$9\")/$G$3,\"\")","v":""},"",{"$f":"IF(B330<INDIRECT($B$1&\"!$C$7\"),H329-G330,\"\")","v":""}]
[null,{"$f":"IF(ISNUMBER(B330),IF(AND(B330<INDIRECT($B$1&\"!$C$7\"),H330>0), B330+0.5,\"\"),\"\")","v":""},"",{"$f":"IF(AND(B331<INDIRECT($B$1&\"!$C$7\"),ISNUMBER(B331)),INDIRECT($B$1&\"!$C$16\")*ERFC(0.5*C331*SQRT(INDIRECT($B$1&\"!$F$10\")/(INDIRECT($B$1&\"!$F$9\")*INDIRECT($B$1&\"!$C$20\")*B331))),\"\")","v":""},{"$f":"(INDIRECT($B$1&\"!$F$15\") -D331)/C331","v":{"$error":"#VALUE!"}},{"$f":"IF(ISNUMBER(E331),E331*INDIRECT($B$1&\"!$F$9\")/$G$3,\"\")","v":""},"",{"$f":"IF(B331<INDIRECT($B$1&\"!$C$7\"),H330-G331,\"\")","v":""}]
[null,{"$f":"IF(ISNUMBER(B331),IF(AND(B331<INDIRECT($B$1&\"!$C$7\"),H331>0), B331+0.5,\"\"),\"\")","v":""},"",{"$f":"IF(AND(B332<INDIRECT($B$1&\"!$C$7\"),ISNUMBER(B332)),INDIRECT($B$1&\"!$C$16\")*ERFC(0.5*C332*SQRT(INDIRECT($B$1&\"!$F$10\")/(INDIRECT($B$1&\"!$F$9\")*INDIRECT($B$1&\"!$C$20\")*B332))),\"\")","v":""},{"$f":"(INDIRECT($B$1&\"!$F$15\") -D332)/C332","v":{"$error":"#VALUE!"}},{"$f":"IF(ISNUMBER(E332),E332*INDIRECT($B$1&\"!$F$9\")/$G$3,\"\")","v":""},"",{"$f":"IF(B332<INDIRECT($B$1&\"!$C$7\"),H331-G332,\"\")","v":""}]
[null,{"$f":"IF(ISNUMBER(B332),IF(AND(B332<INDIRECT($B$1&\"!$C$7\"),H332>0), B332+0.5,\"\"),\"\")","v":""},"",{"$f":"IF(AND(B333<INDIRECT($B$1&\"!$C$7\"),ISNUMBER(B333)),INDIRECT($B$1&\"!$C$16\")*ERFC(0.5*C333*SQRT(INDIRECT($B$1&\"!$F$10\")/(INDIRECT($B$1&\"!$F$9\")*INDIRECT($B$1&\"!$C$20\")*B333))),\"\")","v":""},{"$f":"(INDIRECT($B$1&\"!$F$15\") -D333)/C333","v":{"$error":"#VALUE!"}},{"$f":"IF(ISNUMBER(E333),E333*INDIRECT($B$1&\"!$F$9\")/$G$3,\"\")","v":""},"",{"$f":"IF(B333<INDIRECT($B$1&\"!$C$7\"),H332-G333,\"\")","v":""}]
[null,{"$f":"IF(ISNUMBER(B333),IF(AND(B333<INDIRECT($B$1&\"!$C$7\"),H333>0), B333+0.5,\"\"),\"\")","v":""},"",{"$f":"IF(AND(B334<INDIRECT($B$1&\"!$C$7\"),ISNUMBER(B334)),INDIRECT($B$1&\"!$C$16\")*ERFC(0.5*C334*SQRT(INDIRECT($B$1&\"!$F$10\")/(INDIRECT($B$1&\"!$F$9\")*INDIRECT($B$1&\"!$C$20\")*B334))),\"\")","v":""},{"$f":"(INDIRECT($B$1&\"!$F$15\") -D334)/C334","v":{"$error":"#VALUE!"}},{"$f":"IF(ISNUMBER(E334),E334*INDIRECT($B$1&\"!$F$9\")/$G$3,\"\")","v":""},"",{"$f":"IF(B334<INDIRECT($B$1&\"!$C$7\"),H333-G334,\"\")","v":""}]
[null,{"$f":"IF(ISNUMBER(B334),IF(AND(B334<INDIRECT($B$1&\"!$C$7\"),H334>0), B334+0.5,\"\"),\"\")","v":""},"",{"$f":"IF(AND(B335<INDIRECT($B$1&\"!$C$7\"),ISNUMBER(B335)),INDIRECT($B$1&\"!$C$16\")*ERFC(0.5*C335*SQRT(INDIRECT($B$1&\"!$F$10\")/(INDIRECT($B$1&\"!$F$9\")*INDIRECT($B$1&\"!$C$20\")*B335))),\"\")","v":""},{"$f":"(INDIRECT($B$1&\"!$F$15\") -D335)/C335","v":{"$error":"#VALUE!"}},{"$f":"IF(ISNUMBER(E335),E335*INDIRECT($B$1&\"!$F$9\")/$G$3,\"\")","v":""},"",{"$f":"IF(B335<INDIRECT($B$1&\"!$C$7\"),H334-G335,\"\")","v":""}]
[null,{"$f":"IF(ISNUMBER(B335),IF(AND(B335<INDIRECT($B$1&\"!$C$7\"),H335>0), B335+0.5,\"\"),\"\")","v":""},"",{"$f":"IF(AND(B336<INDIRECT($B$1&\"!$C$7\"),ISNUMBER(B336)),INDIRECT($B$1&\"!$C$16\")*ERFC(0.5*C336*SQRT(INDIRECT($B$1&\"!$F$10\")/(INDIRECT($B$1&\"!$F$9\")*INDIRECT($B$1&\"!$C$20\")*B336))),\"\")","v":""},{"$f":"(INDIRECT($B$1&\"!$F$15\") -D336)/C336","v":{"$error":"#VALUE!"}},{"$f":"IF(ISNUMBER(E336),E336*INDIRECT($B$1&\"!$F$9\")/$G$3,\"\")","v":""},"",{"$f":"IF(B336<INDIRECT($B$1&\"!$C$7\"),H335-G336,\"\")","v":""}]
[null,{"$f":"IF(ISNUMBER(B336),IF(AND(B336<INDIRECT($B$1&\"!$C$7\"),H336>0), B336+0.5,\"\"),\"\")","v":""},"",{"$f":"IF(AND(B337<INDIRECT($B$1&\"!$C$7\"),ISNUMBER(B337)),INDIRECT($B$1&\"!$C$16\")*ERFC(0.5*C337*SQRT(INDIRECT($B$1&\"!$F$10\")/(INDIRECT($B$1&\"!$F$9\")*INDIRECT($B$1&\"!$C$20\")*B337))),\"\")","v":""},{"$f":"(INDIRECT($B$1&\"!$F$15\") -D337)/C337","v":{"$error":"#VALUE!"}},{"$f":"IF(ISNUMBER(E337),E337*INDIRECT($B$1&\"!$F$9\")/$G$3,\"\")","v":""},"",{"$f":"IF(B337<INDIRECT($B$1&\"!$C$7\"),H336-G337,\"\")","v":""}]
[null,{"$f":"IF(ISNUMBER(B337),IF(AND(B337<INDIRECT($B$1&\"!$C$7\"),H337>0), B337+0.5,\"\"),\"\")","v":""},"",{"$f":"IF(AND(B338<INDIRECT($B$1&\"!$C$7\"),ISNUMBER(B338)),INDIRECT($B$1&\"!$C$16\")*ERFC(0.5*C338*SQRT(INDIRECT($B$1&\"!$F$10\")/(INDIRECT($B$1&\"!$F$9\")*INDIRECT($B$1&\"!$C$20\")*B338))),\"\")","v":""},{"$f":"(INDIRECT($B$1&\"!$F$15\") -D338)/C338","v":{"$error":"#VALUE!"}},{"$f":"IF(ISNUMBER(E338),E338*INDIRECT($B$1&\"!$F$9\")/$G$3,\"\")","v":""},"",{"$f":"IF(B338<INDIRECT($B$1&\"!$C$7\"),H337-G338,\"\")","v":""}]
[null,{"$f":"IF(ISNUMBER(B338),IF(AND(B338<INDIRECT($B$1&\"!$C$7\"),H338>0), B338+0.5,\"\"),\"\")","v":""},"",{"$f":"IF(AND(B339<INDIRECT($B$1&\"!$C$7\"),ISNUMBER(B339)),INDIRECT($B$1&\"!$C$16\")*ERFC(0.5*C339*SQRT(INDIRECT($B$1&\"!$F$10\")/(INDIRECT($B$1&\"!$F$9\")*INDIRECT($B$1&\"!$C$20\")*B339))),\"\")","v":""},{"$f":"(INDIRECT($B$1&\"!$F$15\") -D339)/C339","v":{"$error":"#VALUE!"}},{"$f":"IF(ISNUMBER(E339),E339*INDIRECT($B$1&\"!$F$9\")/$G$3,\"\")","v":""},"",{"$f":"IF(B339<INDIRECT($B$1&\"!$C$7\"),H338-G339,\"\")","v":""}]
[null,{"$f":"IF(ISNUMBER(B339),IF(AND(B339<INDIRECT($B$1&\"!$C$7\"),H339>0), B339+0.5,\"\"),\"\")","v":""},"",{"$f":"IF(AND(B340<INDIRECT($B$1&\"!$C$7\"),ISNUMBER(B340)),INDIRECT($B$1&\"!$C$16\")*ERFC(0.5*C340*SQRT(INDIRECT($B$1&\"!$F$10\")/(INDIRECT($B$1&\"!$F$9\")*INDIRECT($B$1&\"!$C$20\")*B340))),\"\")","v":""},{"$f":"(INDIRECT($B$1&\"!$F$15\") -D340)/C340","v":{"$error":"#VALUE!"}},{"$f":"IF(ISNUMBER(E340),E340*INDIRECT($B$1&\"!$F$9\")/$G$3,\"\")","v":""},"",{"$f":"IF(B340<INDIRECT($B$1&\"!$C$7\"),H339-G340,\"\")","v":""}]
[null,{"$f":"IF(ISNUMBER(B340),IF(AND(B340<INDIRECT($B$1&\"!$C$7\"),H340>0), B340+0.5,\"\"),\"\")","v":""},"",{"$f":"IF(AND(B341<INDIRECT($B$1&\"!$C$7\"),ISNUMBER(B341)),INDIRECT($B$1&\"!$C$16\")*ERFC(0.5*C341*SQRT(INDIRECT($B$1&\"!$F$10\")/(INDIRECT($B$1&\"!$F$9\")*INDIRECT($B$1&\"!$C$20\")*B341))),\"\")","v":""},{"$f":"(INDIRECT($B$1&\"!$F$15\") -D341)/C341","v":{"$error":"#VALUE!"}},{"$f":"IF(ISNUMBER(E341),E341*INDIRECT($B$1&\"!$F$9\")/$G$3,\"\")","v":""},"",{"$f":"IF(B341<INDIRECT($B$1&\"!$C$7\"),H340-G341,\"\")","v":""}]
[null,{"$f":"IF(ISNUMBER(B341),IF(AND(B341<INDIRECT($B$1&\"!$C$7\"),H341>0), B341+0.5,\"\"),\"\")","v":""},"",{"$f":"IF(AND(B342<INDIRECT($B$1&\"!$C$7\"),ISNUMBER(B342)),INDIRECT($B$1&\"!$C$16\")*ERFC(0.5*C342*SQRT(INDIRECT($B$1&\"!$F$10\")/(INDIRECT($B$1&\"!$F$9\")*INDIRECT($B$1&\"!$C$20\")*B342))),\"\")","v":""},{"$f":"(INDIRECT($B$1&\"!$F$15\") -D342)/C342","v":{"$error":"#VALUE!"}},{"$f":"IF(ISNUMBER(E342),E342*INDIRECT($B$1&\"!$F$9\")/$G$3,\"\")","v":""},"",{"$f":"IF(B342<INDIRECT($B$1&\"!$C$7\"),H341-G342,\"\")","v":""}]
[null,{"$f":"IF(ISNUMBER(B342),IF(AND(B342<INDIRECT($B$1&\"!$C$7\"),H342>0), B342+0.5,\"\"),\"\")","v":""},"",{"$f":"IF(AND(B343<INDIRECT($B$1&\"!$C$7\"),ISNUMBER(B343)),INDIRECT($B$1&\"!$C$16\")*ERFC(0.5*C343*SQRT(INDIRECT($B$1&\"!$F$10\")/(INDIRECT($B$1&\"!$F$9\")*INDIRECT($B$1&\"!$C$20\")*B343))),\"\")","v":""},{"$f":"(INDIRECT($B$1&\"!$F$15\") -D343)/C343","v":{"$error":"#VALUE!"}},{"$f":"IF(ISNUMBER(E343),E343*INDIRECT($B$1&\"!$F$9\")/$G$3,\"\")","v":""},"",{"$f":"IF(B343<INDIRECT($B$1&\"!$C$7\"),H342-G343,\"\")","v":""}]
[null,{"$f":"IF(ISNUMBER(B343),IF(AND(B343<INDIRECT($B$1&\"!$C$7\"),H343>0), B343+0.5,\"\"),\"\")","v":""},"",{"$f":"IF(AND(B344<INDIRECT($B$1&\"!$C$7\"),ISNUMBER(B344)),INDIRECT($B$1&\"!$C$16\")*ERFC(0.5*C344*SQRT(INDIRECT($B$1&\"!$F$10\")/(INDIRECT($B$1&\"!$F$9\")*INDIRECT($B$1&\"!$C$20\")*B344))),\"\")","v":""},{"$f":"(INDIRECT($B$1&\"!$F$15\") -D344)/C344","v":{"$error":"#VALUE!"}},{"$f":"IF(ISNUMBER(E344),E344*INDIRECT($B$1&\"!$F$9\")/$G$3,\"\")","v":""},"",{"$f":"IF(B344<INDIRECT($B$1&\"!$C$7\"),H343-G344,\"\")","v":""}]
[null,{"$f":"IF(ISNUMBER(B344),IF(AND(B344<INDIRECT($B$1&\"!$C$7\"),H344>0), B344+0.5,\"\"),\"\")","v":""},"",{"$f":"IF(AND(B345<INDIRECT($B$1&\"!$C$7\"),ISNUMBER(B345)),INDIRECT($B$1&\"!$C$16\")*ERFC(0.5*C345*SQRT(INDIRECT($B$1&\"!$F$10\")/(INDIRECT($B$1&\"!$F$9\")*INDIRECT($B$1&\"!$C$20\")*B345))),\"\")","v":""},{"$f":"(INDIRECT($B$1&\"!$F$15\") -D345)/C345","v":{"$error":"#VALUE!"}},{"$f":"IF(ISNUMBER(E345),E345*INDIRECT($B$1&\"!$F$9\")/$G$3,\"\")","v":""},"",{"$f":"IF(B345<INDIRECT($B$1&\"!$C$7\"),H344-G345,\"\")","v":""}]
[null,{"$f":"IF(ISNUMBER(B345),IF(AND(B345<INDIRECT($B$1&\"!$C$7\"),H345>0), B345+0.5,\"\"),\"\")","v":""},"",{"$f":"IF(AND(B346<INDIRECT($B$1&\"!$C$7\"),ISNUMBER(B346)),INDIRECT($B$1&\"!$C$16\")*ERFC(0.5*C346*SQRT(INDIRECT($B$1&\"!$F$10\")/(INDIRECT($B$1&\"!$F$9\")*INDIRECT($B$1&\"!$C$20\")*B346))),\"\")","v":""},{"$f":"(INDIRECT($B$1&\"!$F$15\") -D346)/C346","v":{"$error":"#VALUE!"}},{"$f":"IF(ISNUMBER(E346),E346*INDIRECT($B$1&\"!$F$9\")/$G$3,\"\")","v":""},"",{"$f":"IF(B346<INDIRECT($B$1&\"!$C$7\"),H345-G346,\"\")","v":""}]
[null,{"$f":"IF(ISNUMBER(B346),IF(AND(B346<INDIRECT($B$1&\"!$C$7\"),H346>0), B346+0.5,\"\"),\"\")","v":""},"",{"$f":"IF(AND(B347<INDIRECT($B$1&\"!$C$7\"),ISNUMBER(B347)),INDIRECT($B$1&\"!$C$16\")*ERFC(0.5*C347*SQRT(INDIRECT($B$1&\"!$F$10\")/(INDIRECT($B$1&\"!$F$9\")*INDIRECT($B$1&\"!$C$20\")*B347))),\"\")","v":""},{"$f":"(INDIRECT($B$1&\"!$F$15\") -D347)/C347","v":{"$error":"#VALUE!"}},{"$f":"IF(ISNUMBER(E347),E347*INDIRECT($B$1&\"!$F$9\")/$G$3,\"\")","v":""},"",{"$f":"IF(B347<INDIRECT($B$1&\"!$C$7\"),H346-G347,\"\")","v":""}]
[null,{"$f":"IF(ISNUMBER(B347),IF(AND(B347<INDIRECT($B$1&\"!$C$7\"),H347>0), B347+0.5,\"\"),\"\")","v":""},"",{"$f":"IF(AND(B348<INDIRECT($B$1&\"!$C$7\"),ISNUMBER(B348)),INDIRECT($B$1&\"!$C$16\")*ERFC(0.5*C348*SQRT(INDIRECT($B$1&\"!$F$10\")/(INDIRECT($B$1&\"!$F$9\")*INDIRECT($B$1&\"!$C$20\")*B348))),\"\")","v":""},{"$f":"(INDIRECT($B$1&\"!$F$15\") -D348)/C348","v":{"$error":"#VALUE!"}},{"$f":"IF(ISNUMBER(E348),E348*INDIRECT($B$1&\"!$F$9\")/$G$3,\"\")","v":""},"",{"$f":"IF(B348<INDIRECT($B$1&\"!$C$7\"),H347-G348,\"\")","v":""}]
[null,{"$f":"IF(ISNUMBER(B348),IF(AND(B348<INDIRECT($B$1&\"!$C$7\"),H348>0), B348+0.5,\"\"),\"\")","v":""},"",{"$f":"IF(AND(B349<INDIRECT($B$1&\"!$C$7\"),ISNUMBER(B349)),INDIRECT($B$1&\"!$C$16\")*ERFC(0.5*C349*SQRT(INDIRECT($B$1&\"!$F$10\")/(INDIRECT($B$1&\"!$F$9\")*INDIRECT($B$1&\"!$C$20\")*B349))),\"\")","v":""},{"$f":"(INDIRECT($B$1&\"!$F$15\") -D349)/C349","v":{"$error":"#VALUE!"}},{"$f":"IF(ISNUMBER(E349),E349*INDIRECT($B$1&\"!$F$9\")/$G$3,\"\")","v":""},"",{"$f":"IF(B349<INDIRECT($B$1&\"!$C$7\"),H348-G349,\"\")","v":""}]
[null,{"$f":"IF(ISNUMBER(B349),IF(AND(B349<INDIRECT($B$1&\"!$C$7\"),H349>0), B349+0.5,\"\"),\"\")","v":""},"",{"$f":"IF(AND(B350<INDIRECT($B$1&\"!$C$7\"),ISNUMBER(B350)),INDIRECT($B$1&\"!$C$16\")*ERFC(0.5*C350*SQRT(INDIRECT($B$1&\"!$F$10\")/(INDIRECT($B$1&\"!$F$9\")*INDIRECT($B$1&\"!$C$20\")*B350))),\"\")","v":""},{"$f":"(INDIRECT($B$1&\"!$F$15\") -D350)/C350","v":{"$error":"#VALUE!"}},{"$f":"IF(ISNUMBER(E350),E350*INDIRECT($B$1&\"!$F$9\")/$G$3,\"\")","v":""},"",{"$f":"IF(B350<INDIRECT($B$1&\"!$C$7\"),H349-G350,\"\")","v":""}]
[null,{"$f":"IF(ISNUMBER(B350),IF(AND(B350<INDIRECT($B$1&\"!$C$7\"),H350>0), B350+0.5,\"\"),\"\")","v":""},"",{"$f":"IF(AND(B351<INDIRECT($B$1&\"!$C$7\"),ISNUMBER(B351)),INDIRECT($B$1&\"!$C$16\")*ERFC(0.5*C351*SQRT(INDIRECT($B$1&\"!$F$10\")/(INDIRECT($B$1&\"!$F$9\")*INDIRECT($B$1&\"!$C$20\")*B351))),\"\")","v":""},{"$f":"(INDIRECT($B$1&\"!$F$15\") -D351)/C351","v":{"$error":"#VALUE!"}},{"$f":"IF(ISNUMBER(E351),E351*INDIRECT($B$1&\"!$F$9\")/$G$3,\"\")","v":""},"",{"$f":"IF(B351<INDIRECT($B$1&\"!$C$7\"),H350-G351,\"\")","v":""}]
[null,{"$f":"IF(ISNUMBER(B351),IF(AND(B351<INDIRECT($B$1&\"!$C$7\"),H351>0), B351+0.5,\"\"),\"\")","v":""},"",{"$f":"IF(AND(B352<INDIRECT($B$1&\"!$C$7\"),ISNUMBER(B352)),INDIRECT($B$1&\"!$C$16\")*ERFC(0.5*C352*SQRT(INDIRECT($B$1&\"!$F$10\")/(INDIRECT($B$1&\"!$F$9\")*INDIRECT($B$1&\"!$C$20\")*B352))),\"\")","v":""},{"$f":"(INDIRECT($B$1&\"!$F$15\") -D352)/C352","v":{"$error":"#VALUE!"}},{"$f":"IF(ISNUMBER(E352),E352*INDIRECT($B$1&\"!$F$9\")/$G$3,\"\")","v":""},"",{"$f":"IF(B352<INDIRECT($B$1&\"!$C$7\"),H351-G352,\"\")","v":""}]
[null,{"$f":"IF(ISNUMBER(B352),IF(AND(B352<INDIRECT($B$1&\"!$C$7\"),H352>0), B352+0.5,\"\"),\"\")","v":""},"",{"$f":"IF(AND(B353<INDIRECT($B$1&\"!$C$7\"),ISNUMBER(B353)),INDIRECT($B$1&\"!$C$16\")*ERFC(0.5*C353*SQRT(INDIRECT($B$1&\"!$F$10\")/(INDIRECT($B$1&\"!$F$9\")*INDIRECT($B$1&\"!$C$20\")*B353))),\"\")","v":""},{"$f":"(INDIRECT($B$1&\"!$F$15\") -D353)/C353","v":{"$error":"#VALUE!"}},{"$f":"IF(ISNUMBER(E353),E353*INDIRECT($B$1&\"!$F$9\")/$G$3,\"\")","v":""},"",{"$f":"IF(B353<INDIRECT($B$1&\"!$C$7\"),H352-G353,\"\")","v":""}]
[null,{"$f":"IF(ISNUMBER(B353),IF(AND(B353<INDIRECT($B$1&\"!$C$7\"),H353>0), B353+0.5,\"\"),\"\")","v":""},"",{"$f":"IF(AND(B354<INDIRECT($B$1&\"!$C$7\"),ISNUMBER(B354)),INDIRECT($B$1&\"!$C$16\")*ERFC(0.5*C354*SQRT(INDIRECT($B$1&\"!$F$10\")/(INDIRECT($B$1&\"!$F$9\")*INDIRECT($B$1&\"!$C$20\")*B354))),\"\")","v":""},{"$f":"(INDIRECT($B$1&\"!$F$15\") -D354)/C354","v":{"$error":"#VALUE!"}},{"$f":"IF(ISNUMBER(E354),E354*INDIRECT($B$1&\"!$F$9\")/$G$3,\"\")","v":""},"",{"$f":"IF(B354<INDIRECT($B$1&\"!$C$7\"),H353-G354,\"\")","v":""}]
[null,{"$f":"IF(ISNUMBER(B354),IF(AND(B354<INDIRECT($B$1&\"!$C$7\"),H354>0), B354+0.5,\"\"),\"\")","v":""},"",{"$f":"IF(AND(B355<INDIRECT($B$1&\"!$C$7\"),ISNUMBER(B355)),INDIRECT($B$1&\"!$C$16\")*ERFC(0.5*C355*SQRT(INDIRECT($B$1&\"!$F$10\")/(INDIRECT($B$1&\"!$F$9\")*INDIRECT($B$1&\"!$C$20\")*B355))),\"\")","v":""},{"$f":"(INDIRECT($B$1&\"!$F$15\") -D355)/C355","v":{"$error":"#VALUE!"}},{"$f":"IF(ISNUMBER(E355),E355*INDIRECT($B$1&\"!$F$9\")/$G$3,\"\")","v":""},"",{"$f":"IF(B355<INDIRECT($B$1&\"!$C$7\"),H354-G355,\"\")","v":""}]
[null,{"$f":"IF(ISNUMBER(B355),IF(AND(B355<INDIRECT($B$1&\"!$C$7\"),H355>0), B355+0.5,\"\"),\"\")","v":""},"",{"$f":"IF(AND(B356<INDIRECT($B$1&\"!$C$7\"),ISNUMBER(B356)),INDIRECT($B$1&\"!$C$16\")*ERFC(0.5*C356*SQRT(INDIRECT($B$1&\"!$F$10\")/(INDIRECT($B$1&\"!$F$9\")*INDIRECT($B$1&\"!$C$20\")*B356))),\"\")","v":""},{"$f":"(INDIRECT($B$1&\"!$F$15\") -D356)/C356","v":{"$error":"#VALUE!"}},{"$f":"IF(ISNUMBER(E356),E356*INDIRECT($B$1&\"!$F$9\")/$G$3,\"\")","v":""},"",{"$f":"IF(B356<INDIRECT($B$1&\"!$C$7\"),H355-G356,\"\")","v":""}]
[null,{"$f":"IF(ISNUMBER(B356),IF(AND(B356<INDIRECT($B$1&\"!$C$7\"),H356>0), B356+0.5,\"\"),\"\")","v":""},"",{"$f":"IF(AND(B357<INDIRECT($B$1&\"!$C$7\"),ISNUMBER(B357)),INDIRECT($B$1&\"!$C$16\")*ERFC(0.5*C357*SQRT(INDIRECT($B$1&\"!$F$10\")/(INDIRECT($B$1&\"!$F$9\")*INDIRECT($B$1&\"!$C$20\")*B357))),\"\")","v":""},{"$f":"(INDIRECT($B$1&\"!$F$15\") -D357)/C357","v":{"$error":"#VALUE!"}},{"$f":"IF(ISNUMBER(E357),E357*INDIRECT($B$1&\"!$F$9\")/$G$3,\"\")","v":""},"",{"$f":"IF(B357<INDIRECT($B$1&\"!$C$7\"),H356-G357,\"\")","v":""}]
[null,{"$f":"IF(ISNUMBER(B357),IF(AND(B357<INDIRECT($B$1&\"!$C$7\"),H357>0), B357+0.5,\"\"),\"\")","v":""},"",{"$f":"IF(AND(B358<INDIRECT($B$1&\"!$C$7\"),ISNUMBER(B358)),INDIRECT($B$1&\"!$C$16\")*ERFC(0.5*C358*SQRT(INDIRECT($B$1&\"!$F$10\")/(INDIRECT($B$1&\"!$F$9\")*INDIRECT($B$1&\"!$C$20\")*B358))),\"\")","v":""},{"$f":"(INDIRECT($B$1&\"!$F$15\") -D358)/C358","v":{"$error":"#VALUE!"}},{"$f":"IF(ISNUMBER(E358),E358*INDIRECT($B$1&\"!$F$9\")/$G$3,\"\")","v":""},"",{"$f":"IF(B358<INDIRECT($B$1&\"!$C$7\"),H357-G358,\"\")","v":""}]
[null,{"$f":"IF(ISNUMBER(B358),IF(AND(B358<INDIRECT($B$1&\"!$C$7\"),H358>0), B358+0.5,\"\"),\"\")","v":""},"",{"$f":"IF(AND(B359<INDIRECT($B$1&\"!$C$7\"),ISNUMBER(B359)),INDIRECT($B$1&\"!$C$16\")*ERFC(0.5*C359*SQRT(INDIRECT($B$1&\"!$F$10\")/(INDIRECT($B$1&\"!$F$9\")*INDIRECT($B$1&\"!$C$20\")*B359))),\"\")","v":""},{"$f":"(INDIRECT($B$1&\"!$F$15\") -D359)/C359","v":{"$error":"#VALUE!"}},{"$f":"IF(ISNUMBER(E359),E359*INDIRECT($B$1&\"!$F$9\")/$G$3,\"\")","v":""},"",{"$f":"IF(B359<INDIRECT($B$1&\"!$C$7\"),H358-G359,\"\")","v":""}]
[null,{"$f":"IF(ISNUMBER(B359),IF(AND(B359<INDIRECT($B$1&\"!$C$7\"),H359>0), B359+0.5,\"\"),\"\")","v":""},"",{"$f":"IF(AND(B360<INDIRECT($B$1&\"!$C$7\"),ISNUMBER(B360)),INDIRECT($B$1&\"!$C$16\")*ERFC(0.5*C360*SQRT(INDIRECT($B$1&\"!$F$10\")/(INDIRECT($B$1&\"!$F$9\")*INDIRECT($B$1&\"!$C$20\")*B360))),\"\")","v":""},{"$f":"(INDIRECT($B$1&\"!$F$15\") -D360)/C360","v":{"$error":"#VALUE!"}},{"$f":"IF(ISNUMBER(E360),E360*INDIRECT($B$1&\"!$F$9\")/$G$3,\"\")","v":""},"",{"$f":"IF(B360<INDIRECT($B$1&\"!$C$7\"),H359-G360,\"\")","v":""}]
[null,{"$f":"IF(ISNUMBER(B360),IF(AND(B360<INDIRECT($B$1&\"!$C$7\"),H360>0), B360+0.5,\"\"),\"\")","v":""},"",{"$f":"IF(AND(B361<INDIRECT($B$1&\"!$C$7\"),ISNUMBER(B361)),INDIRECT($B$1&\"!$C$16\")*ERFC(0.5*C361*SQRT(INDIRECT($B$1&\"!$F$10\")/(INDIRECT($B$1&\"!$F$9\")*INDIRECT($B$1&\"!$C$20\")*B361))),\"\")","v":""},{"$f":"(INDIRECT($B$1&\"!$F$15\") -D361)/C361","v":{"$error":"#VALUE!"}},{"$f":"IF(ISNUMBER(E361),E361*INDIRECT($B$1&\"!$F$9\")/$G$3,\"\")","v":""},"",{"$f":"IF(B361<INDIRECT($B$1&\"!$C$7\"),H360-G361,\"\")","v":""}]
[null,{"$f":"IF(ISNUMBER(B361),IF(AND(B361<INDIRECT($B$1&\"!$C$7\"),H361>0), B361+0.5,\"\"),\"\")","v":""},"",{"$f":"IF(AND(B362<INDIRECT($B$1&\"!$C$7\"),ISNUMBER(B362)),INDIRECT($B$1&\"!$C$16\")*ERFC(0.5*C362*SQRT(INDIRECT($B$1&\"!$F$10\")/(INDIRECT($B$1&\"!$F$9\")*INDIRECT($B$1&\"!$C$20\")*B362))),\"\")","v":""},{"$f":"(INDIRECT($B$1&\"!$F$15\") -D362)/C362","v":{"$error":"#VALUE!"}},{"$f":"IF(ISNUMBER(E362),E362*INDIRECT($B$1&\"!$F$9\")/$G$3,\"\")","v":""},"",{"$f":"IF(B362<INDIRECT($B$1&\"!$C$7\"),H361-G362,\"\")","v":""}]
[null,{"$f":"IF(ISNUMBER(B362),IF(AND(B362<INDIRECT($B$1&\"!$C$7\"),H362>0), B362+0.5,\"\"),\"\")","v":""},"",{"$f":"IF(AND(B363<INDIRECT($B$1&\"!$C$7\"),ISNUMBER(B363)),INDIRECT($B$1&\"!$C$16\")*ERFC(0.5*C363*SQRT(INDIRECT($B$1&\"!$F$10\")/(INDIRECT($B$1&\"!$F$9\")*INDIRECT($B$1&\"!$C$20\")*B363))),\"\")","v":""},{"$f":"(INDIRECT($B$1&\"!$F$15\") -D363)/C363","v":{"$error":"#VALUE!"}},{"$f":"IF(ISNUMBER(E363),E363*INDIRECT($B$1&\"!$F$9\")/$G$3,\"\")","v":""},"",{"$f":"IF(B363<INDIRECT($B$1&\"!$C$7\"),H362-G363,\"\")","v":""}]
[null,{"$f":"IF(ISNUMBER(B363),IF(AND(B363<INDIRECT($B$1&\"!$C$7\"),H363>0), B363+0.5,\"\"),\"\")","v":""},"",{"$f":"IF(AND(B364<INDIRECT($B$1&\"!$C$7\"),ISNUMBER(B364)),INDIRECT($B$1&\"!$C$16\")*ERFC(0.5*C364*SQRT(INDIRECT($B$1&\"!$F$10\")/(INDIRECT($B$1&\"!$F$9\")*INDIRECT($B$1&\"!$C$20\")*B364))),\"\")","v":""},{"$f":"(INDIRECT($B$1&\"!$F$15\") -D364)/C364","v":{"$error":"#VALUE!"}},{"$f":"IF(ISNUMBER(E364),E364*INDIRECT($B$1&\"!$F$9\")/$G$3,\"\")","v":""},"",{"$f":"IF(B364<INDIRECT($B$1&\"!$C$7\"),H363-G364,\"\")","v":""}]
[null,{"$f":"IF(ISNUMBER(B364),IF(AND(B364<INDIRECT($B$1&\"!$C$7\"),H364>0), B364+0.5,\"\"),\"\")","v":""},"",{"$f":"IF(AND(B365<INDIRECT($B$1&\"!$C$7\"),ISNUMBER(B365)),INDIRECT($B$1&\"!$C$16\")*ERFC(0.5*C365*SQRT(INDIRECT($B$1&\"!$F$10\")/(INDIRECT($B$1&\"!$F$9\")*INDIRECT($B$1&\"!$C$20\")*B365))),\"\")","v":""},{"$f":"(INDIRECT($B$1&\"!$F$15\") -D365)/C365","v":{"$error":"#VALUE!"}},{"$f":"IF(ISNUMBER(E365),E365*INDIRECT($B$1&\"!$F$9\")/$G$3,\"\")","v":""},"",{"$f":"IF(B365<INDIRECT($B$1&\"!$C$7\"),H364-G365,\"\")","v":""}]
[null,{"$f":"IF(ISNUMBER(B365),IF(AND(B365<INDIRECT($B$1&\"!$C$7\"),H365>0), B365+0.5,\"\"),\"\")","v":""},"",{"$f":"IF(AND(B366<INDIRECT($B$1&\"!$C$7\"),ISNUMBER(B366)),INDIRECT($B$1&\"!$C$16\")*ERFC(0.5*C366*SQRT(INDIRECT($B$1&\"!$F$10\")/(INDIRECT($B$1&\"!$F$9\")*INDIRECT($B$1&\"!$C$20\")*B366))),\"\")","v":""},{"$f":"(INDIRECT($B$1&\"!$F$15\") -D366)/C366","v":{"$error":"#VALUE!"}},{"$f":"IF(ISNUMBER(E366),E366*INDIRECT($B$1&\"!$F$9\")/$G$3,\"\")","v":""},"",{"$f":"IF(B366<INDIRECT($B$1&\"!$C$7\"),H365-G366,\"\")","v":""}]
[null,{"$f":"IF(ISNUMBER(B366),IF(AND(B366<INDIRECT($B$1&\"!$C$7\"),H366>0), B366+0.5,\"\"),\"\")","v":""},"",{"$f":"IF(AND(B367<INDIRECT($B$1&\"!$C$7\"),ISNUMBER(B367)),INDIRECT($B$1&\"!$C$16\")*ERFC(0.5*C367*SQRT(INDIRECT($B$1&\"!$F$10\")/(INDIRECT($B$1&\"!$F$9\")*INDIRECT($B$1&\"!$C$20\")*B367))),\"\")","v":""},{"$f":"(INDIRECT($B$1&\"!$F$15\") -D367)/C367","v":{"$error":"#VALUE!"}},{"$f":"IF(ISNUMBER(E367),E367*INDIRECT($B$1&\"!$F$9\")/$G$3,\"\")","v":""},"",{"$f":"IF(B367<INDIRECT($B$1&\"!$C$7\"),H366-G367,\"\")","v":""}]
[null,{"$f":"IF(ISNUMBER(B367),IF(AND(B367<INDIRECT($B$1&\"!$C$7\"),H367>0), B367+0.5,\"\"),\"\")","v":""},"",{"$f":"IF(AND(B368<INDIRECT($B$1&\"!$C$7\"),ISNUMBER(B368)),INDIRECT($B$1&\"!$C$16\")*ERFC(0.5*C368*SQRT(INDIRECT($B$1&\"!$F$10\")/(INDIRECT($B$1&\"!$F$9\")*INDIRECT($B$1&\"!$C$20\")*B368))),\"\")","v":""},{"$f":"(INDIRECT($B$1&\"!$F$15\") -D368)/C368","v":{"$error":"#VALUE!"}},{"$f":"IF(ISNUMBER(E368),E368*INDIRECT($B$1&\"!$F$9\")/$G$3,\"\")","v":""},"",{"$f":"IF(B368<INDIRECT($B$1&\"!$C$7\"),H367-G368,\"\")","v":""}]
[null,{"$f":"IF(ISNUMBER(B368),IF(AND(B368<INDIRECT($B$1&\"!$C$7\"),H368>0), B368+0.5,\"\"),\"\")","v":""},{"$f":"IF(ISNUMBER(B369),H368,\"\")","v":""},{"$f":"IF(AND(B369<INDIRECT($B$1&\"!$C$7\"),ISNUMBER(B369)),INDIRECT($B$1&\"!$C$16\")*ERFC(0.5*C369*SQRT(INDIRECT($B$1&\"!$F$10\")/(INDIRECT($B$1&\"!$F$9\")*INDIRECT($B$1&\"!$C$20\")*B369))),\"\")","v":""},{"$f":"(INDIRECT($B$1&\"!$F$15\") -D369)/C369","v":{"$error":"#VALUE!"}},{"$f":"IF(ISNUMBER(E369),E369*INDIRECT($B$1&\"!$F$9\")/$G$3,\"\")","v":""},{"$f":"IF(ISNUMBER(F369),F369*ABS(B368-B369)/$I$3,\"\")","v":""},{"$f":"IF(B369<INDIRECT($B$1&\"!$C$7\"),H368-G369,\"\")","v":""}]
[null,{"$f":"IF(ISNUMBER(B369),IF(AND(B369<INDIRECT($B$1&\"!$C$7\"),H369>0), B369+0.5,\"\"),\"\")","v":""},"",{"$f":"IF(AND(B370<INDIRECT($B$1&\"!$C$7\"),ISNUMBER(B370)),INDIRECT($B$1&\"!$C$16\")*ERFC(0.5*C370*SQRT(INDIRECT($B$1&\"!$F$10\")/(INDIRECT($B$1&\"!$F$9\")*INDIRECT($B$1&\"!$C$20\")*B370))),\"\")","v":""},{"$f":"(INDIRECT($B$1&\"!$F$15\") -D370)/C370","v":{"$error":"#VALUE!"}},{"$f":"IF(ISNUMBER(E370),E370*INDIRECT($B$1&\"!$F$9\")/$G$3,\"\")","v":""},"",{"$f":"IF(B370<INDIRECT($B$1&\"!$C$7\"),H369-G370,\"\")","v":""}]
[null,{"$f":"IF(ISNUMBER(B370),IF(AND(B370<INDIRECT($B$1&\"!$C$7\"),H370>0), B370+0.5,\"\"),\"\")","v":""},"",{"$f":"IF(AND(B371<INDIRECT($B$1&\"!$C$7\"),ISNUMBER(B371)),INDIRECT($B$1&\"!$C$16\")*ERFC(0.5*C371*SQRT(INDIRECT($B$1&\"!$F$10\")/(INDIRECT($B$1&\"!$F$9\")*INDIRECT($B$1&\"!$C$20\")*B371))),\"\")","v":""},{"$f":"(INDIRECT($B$1&\"!$F$15\") -D371)/C371","v":{"$error":"#VALUE!"}},{"$f":"IF(ISNUMBER(E371),E371*INDIRECT($B$1&\"!$F$9\")/$G$3,\"\")","v":""},"",{"$f":"IF(B371<INDIRECT($B$1&\"!$C$7\"),H370-G371,\"\")","v":""}]
[null,{"$f":"IF(ISNUMBER(B371),IF(AND(B371<INDIRECT($B$1&\"!$C$7\"),H371>0), B371+0.5,\"\"),\"\")","v":""},"",{"$f":"IF(AND(B372<INDIRECT($B$1&\"!$C$7\"),ISNUMBER(B372)),INDIRECT($B$1&\"!$C$16\")*ERFC(0.5*C372*SQRT(INDIRECT($B$1&\"!$F$10\")/(INDIRECT($B$1&\"!$F$9\")*INDIRECT($B$1&\"!$C$20\")*B372))),\"\")","v":""},{"$f":"(INDIRECT($B$1&\"!$F$15\") -D372)/C372","v":{"$error":"#VALUE!"}},{"$f":"IF(ISNUMBER(E372),E372*INDIRECT($B$1&\"!$F$9\")/$G$3,\"\")","v":""},"",{"$f":"IF(B372<INDIRECT($B$1&\"!$C$7\"),H371-G372,\"\")","v":""}]
[null,{"$f":"IF(ISNUMBER(B372),IF(AND(B372<INDIRECT($B$1&\"!$C$7\"),H372>0), B372+0.5,\"\"),\"\")","v":""},"",{"$f":"IF(AND(B373<INDIRECT($B$1&\"!$C$7\"),ISNUMBER(B373)),INDIRECT($B$1&\"!$C$16\")*ERFC(0.5*C373*SQRT(INDIRECT($B$1&\"!$F$10\")/(INDIRECT($B$1&\"!$F$9\")*INDIRECT($B$1&\"!$C$20\")*B373))),\"\")","v":""},{"$f":"(INDIRECT($B$1&\"!$F$15\") -D373)/C373","v":{"$error":"#VALUE!"}},{"$f":"IF(ISNUMBER(E373),E373*INDIRECT($B$1&\"!$F$9\")/$G$3,\"\")","v":""},"",{"$f":"IF(B373<INDIRECT($B$1&\"!$C$7\"),H372-G373,\"\")","v":""}]
[null,{"$f":"IF(ISNUMBER(B373),IF(AND(B373<INDIRECT($B$1&\"!$C$7\"),H373>0), B373+0.5,\"\"),\"\")","v":""},"",{"$f":"IF(AND(B374<INDIRECT($B$1&\"!$C$7\"),ISNUMBER(B374)),INDIRECT($B$1&\"!$C$16\")*ERFC(0.5*C374*SQRT(INDIRECT($B$1&\"!$F$10\")/(INDIRECT($B$1&\"!$F$9\")*INDIRECT($B$1&\"!$C$20\")*B374))),\"\")","v":""},{"$f":"(INDIRECT($B$1&\"!$F$15\") -D374)/C374","v":{"$error":"#VALUE!"}},{"$f":"IF(ISNUMBER(E374),E374*INDIRECT($B$1&\"!$F$9\")/$G$3,\"\")","v":""},"",{"$f":"IF(B374<INDIRECT($B$1&\"!$C$7\"),H373-G374,\"\")","v":""}]
[null,{"$f":"IF(ISNUMBER(B374),IF(AND(B374<INDIRECT($B$1&\"!$C$7\"),H374>0), B374+0.5,\"\"),\"\")","v":""},"",{"$f":"IF(AND(B375<INDIRECT($B$1&\"!$C$7\"),ISNUMBER(B375)),INDIRECT($B$1&\"!$C$16\")*ERFC(0.5*C375*SQRT(INDIRECT($B$1&\"!$F$10\")/(INDIRECT($B$1&\"!$F$9\")*INDIRECT($B$1&\"!$C$20\")*B375))),\"\")","v":""},{"$f":"(INDIRECT($B$1&\"!$F$15\") -D375)/C375","v":{"$error":"#VALUE!"}},{"$f":"IF(ISNUMBER(E375),E375*INDIRECT($B$1&\"!$F$9\")/$G$3,\"\")","v":""},"",{"$f":"IF(B375<INDIRECT($B$1&\"!$C$7\"),H374-G375,\"\")","v":""}]
[null,{"$f":"IF(ISNUMBER(B375),IF(AND(B375<INDIRECT($B$1&\"!$C$7\"),H375>0), B375+0.5,\"\"),\"\")","v":""},"",{"$f":"IF(AND(B376<INDIRECT($B$1&\"!$C$7\"),ISNUMBER(B376)),INDIRECT($B$1&\"!$C$16\")*ERFC(0.5*C376*SQRT(INDIRECT($B$1&\"!$F$10\")/(INDIRECT($B$1&\"!$F$9\")*INDIRECT($B$1&\"!$C$20\")*B376))),\"\")","v":""},{"$f":"(INDIRECT($B$1&\"!$F$15\") -D376)/C376","v":{"$error":"#VALUE!"}},{"$f":"IF(ISNUMBER(E376),E376*INDIRECT($B$1&\"!$F$9\")/$G$3,\"\")","v":""},"",{"$f":"IF(B376<INDIRECT($B$1&\"!$C$7\"),H375-G376,\"\")","v":""}]
[null,{"$f":"IF(ISNUMBER(B376),IF(AND(B376<INDIRECT($B$1&\"!$C$7\"),H376>0), B376+0.5,\"\"),\"\")","v":""},"",{"$f":"IF(AND(B377<INDIRECT($B$1&\"!$C$7\"),ISNUMBER(B377)),INDIRECT($B$1&\"!$C$16\")*ERFC(0.5*C377*SQRT(INDIRECT($B$1&\"!$F$10\")/(INDIRECT($B$1&\"!$F$9\")*INDIRECT($B$1&\"!$C$20\")*B377))),\"\")","v":""},{"$f":"(INDIRECT($B$1&\"!$F$15\") -D377)/C377","v":{"$error":"#VALUE!"}},{"$f":"IF(ISNUMBER(E377),E377*INDIRECT($B$1&\"!$F$9\")/$G$3,\"\")","v":""},"",{"$f":"IF(B377<INDIRECT($B$1&\"!$C$7\"),H376-G377,\"\")","v":""}]
[null,{"$f":"IF(ISNUMBER(B377),IF(AND(B377<INDIRECT($B$1&\"!$C$7\"),H377>0), B377+0.5,\"\"),\"\")","v":""},"",{"$f":"IF(AND(B378<INDIRECT($B$1&\"!$C$7\"),ISNUMBER(B378)),INDIRECT($B$1&\"!$C$16\")*ERFC(0.5*C378*SQRT(INDIRECT($B$1&\"!$F$10\")/(INDIRECT($B$1&\"!$F$9\")*INDIRECT($B$1&\"!$C$20\")*B378))),\"\")","v":""},{"$f":"(INDIRECT($B$1&\"!$F$15\") -D378)/C378","v":{"$error":"#VALUE!"}},{"$f":"IF(ISNUMBER(E378),E378*INDIRECT($B$1&\"!$F$9\")/$G$3,\"\")","v":""},"",{"$f":"IF(B378<INDIRECT($B$1&\"!$C$7\"),H377-G378,\"\")","v":""}]
[null,{"$f":"IF(ISNUMBER(B378),IF(AND(B378<INDIRECT($B$1&\"!$C$7\"),H378>0), B378+0.5,\"\"),\"\")","v":""},"",{"$f":"IF(AND(B379<INDIRECT($B$1&\"!$C$7\"),ISNUMBER(B379)),INDIRECT($B$1&\"!$C$16\")*ERFC(0.5*C379*SQRT(INDIRECT($B$1&\"!$F$10\")/(INDIRECT($B$1&\"!$F$9\")*INDIRECT($B$1&\"!$C$20\")*B379))),\"\")","v":""},{"$f":"(INDIRECT($B$1&\"!$F$15\") -D379)/C379","v":{"$error":"#VALUE!"}},{"$f":"IF(ISNUMBER(E379),E379*INDIRECT($B$1&\"!$F$9\")/$G$3,\"\")","v":""},"",{"$f":"IF(B379<INDIRECT($B$1&\"!$C$7\"),H378-G379,\"\")","v":""}]
[null,{"$f":"IF(ISNUMBER(B379),IF(AND(B379<INDIRECT($B$1&\"!$C$7\"),H379>0), B379+0.5,\"\"),\"\")","v":""},"",{"$f":"IF(AND(B380<INDIRECT($B$1&\"!$C$7\"),ISNUMBER(B380)),INDIRECT($B$1&\"!$C$16\")*ERFC(0.5*C380*SQRT(INDIRECT($B$1&\"!$F$10\")/(INDIRECT($B$1&\"!$F$9\")*INDIRECT($B$1&\"!$C$20\")*B380))),\"\")","v":""},{"$f":"(INDIRECT($B$1&\"!$F$15\") -D380)/C380","v":{"$error":"#VALUE!"}},{"$f":"IF(ISNUMBER(E380),E380*INDIRECT($B$1&\"!$F$9\")/$G$3,\"\")","v":""},"",{"$f":"IF(B380<INDIRECT($B$1&\"!$C$7\"),H379-G380,\"\")","v":""}]
[null,{"$f":"IF(ISNUMBER(B380),IF(AND(B380<INDIRECT($B$1&\"!$C$7\"),H380>0), B380+0.5,\"\"),\"\")","v":""},"",{"$f":"IF(AND(B381<INDIRECT($B$1&\"!$C$7\"),ISNUMBER(B381)),INDIRECT($B$1&\"!$C$16\")*ERFC(0.5*C381*SQRT(INDIRECT($B$1&\"!$F$10\")/(INDIRECT($B$1&\"!$F$9\")*INDIRECT($B$1&\"!$C$20\")*B381))),\"\")","v":""},{"$f":"(INDIRECT($B$1&\"!$F$15\") -D381)/C381","v":{"$error":"#VALUE!"}},{"$f":"IF(ISNUMBER(E381),E381*INDIRECT($B$1&\"!$F$9\")/$G$3,\"\")","v":""},"",{"$f":"IF(B381<INDIRECT($B$1&\"!$C$7\"),H380-G381,\"\")","v":""}]
[null,{"$f":"IF(ISNUMBER(B381),IF(AND(B381<INDIRECT($B$1&\"!$C$7\"),H381>0), B381+0.5,\"\"),\"\")","v":""},"",{"$f":"IF(AND(B382<INDIRECT($B$1&\"!$C$7\"),ISNUMBER(B382)),INDIRECT($B$1&\"!$C$16\")*ERFC(0.5*C382*SQRT(INDIRECT($B$1&\"!$F$10\")/(INDIRECT($B$1&\"!$F$9\")*INDIRECT($B$1&\"!$C$20\")*B382))),\"\")","v":""},{"$f":"(INDIRECT($B$1&\"!$F$15\") -D382)/C382","v":{"$error":"#VALUE!"}},{"$f":"IF(ISNUMBER(E382),E382*INDIRECT($B$1&\"!$F$9\")/$G$3,\"\")","v":""},"",{"$f":"IF(B382<INDIRECT($B$1&\"!$C$7\"),H381-G382,\"\")","v":""}]
[null,{"$f":"IF(ISNUMBER(B382),IF(AND(B382<INDIRECT($B$1&\"!$C$7\"),H382>0), B382+0.5,\"\"),\"\")","v":""},"",{"$f":"IF(AND(B383<INDIRECT($B$1&\"!$C$7\"),ISNUMBER(B383)),INDIRECT($B$1&\"!$C$16\")*ERFC(0.5*C383*SQRT(INDIRECT($B$1&\"!$F$10\")/(INDIRECT($B$1&\"!$F$9\")*INDIRECT($B$1&\"!$C$20\")*B383))),\"\")","v":""},{"$f":"(INDIRECT($B$1&\"!$F$15\") -D383)/C383","v":{"$error":"#VALUE!"}},{"$f":"IF(ISNUMBER(E383),E383*INDIRECT($B$1&\"!$F$9\")/$G$3,\"\")","v":""},"",{"$f":"IF(B383<INDIRECT($B$1&\"!$C$7\"),H382-G383,\"\")","v":""}]
[null,{"$f":"IF(ISNUMBER(B383),IF(AND(B383<INDIRECT($B$1&\"!$C$7\"),H383>0), B383+0.5,\"\"),\"\")","v":""},"",{"$f":"IF(AND(B384<INDIRECT($B$1&\"!$C$7\"),ISNUMBER(B384)),INDIRECT($B$1&\"!$C$16\")*ERFC(0.5*C384*SQRT(INDIRECT($B$1&\"!$F$10\")/(INDIRECT($B$1&\"!$F$9\")*INDIRECT($B$1&\"!$C$20\")*B384))),\"\")","v":""},{"$f":"(INDIRECT($B$1&\"!$F$15\") -D384)/C384","v":{"$error":"#VALUE!"}},{"$f":"IF(ISNUMBER(E384),E384*INDIRECT($B$1&\"!$F$9\")/$G$3,\"\")","v":""},"",{"$f":"IF(B384<INDIRECT($B$1&\"!$C$7\"),H383-G384,\"\")","v":""}]
[null,{"$f":"IF(ISNUMBER(B384),IF(AND(B384<INDIRECT($B$1&\"!$C$7\"),H384>0), B384+0.5,\"\"),\"\")","v":""},"",{"$f":"IF(AND(B385<INDIRECT($B$1&\"!$C$7\"),ISNUMBER(B385)),INDIRECT($B$1&\"!$C$16\")*ERFC(0.5*C385*SQRT(INDIRECT($B$1&\"!$F$10\")/(INDIRECT($B$1&\"!$F$9\")*INDIRECT($B$1&\"!$C$20\")*B385))),\"\")","v":""},{"$f":"(INDIRECT($B$1&\"!$F$15\") -D385)/C385","v":{"$error":"#VALUE!"}},{"$f":"IF(ISNUMBER(E385),E385*INDIRECT($B$1&\"!$F$9\")/$G$3,\"\")","v":""},"",{"$f":"IF(B385<INDIRECT($B$1&\"!$C$7\"),H384-G385,\"\")","v":""}]
[null,{"$f":"IF(ISNUMBER(B385),IF(AND(B385<INDIRECT($B$1&\"!$C$7\"),H385>0), B385+0.5,\"\"),\"\")","v":""},"",{"$f":"IF(AND(B386<INDIRECT($B$1&\"!$C$7\"),ISNUMBER(B386)),INDIRECT($B$1&\"!$C$16\")*ERFC(0.5*C386*SQRT(INDIRECT($B$1&\"!$F$10\")/(INDIRECT($B$1&\"!$F$9\")*INDIRECT($B$1&\"!$C$20\")*B386))),\"\")","v":""},{"$f":"(INDIRECT($B$1&\"!$F$15\") -D386)/C386","v":{"$error":"#VALUE!"}},{"$f":"IF(ISNUMBER(E386),E386*INDIRECT($B$1&\"!$F$9\")/$G$3,\"\")","v":""},"",{"$f":"IF(B386<INDIRECT($B$1&\"!$C$7\"),H385-G386,\"\")","v":""}]
[null,{"$f":"IF(ISNUMBER(B386),IF(AND(B386<INDIRECT($B$1&\"!$C$7\"),H386>0), B386+0.5,\"\"),\"\")","v":""},"",{"$f":"IF(AND(B387<INDIRECT($B$1&\"!$C$7\"),ISNUMBER(B387)),INDIRECT($B$1&\"!$C$16\")*ERFC(0.5*C387*SQRT(INDIRECT($B$1&\"!$F$10\")/(INDIRECT($B$1&\"!$F$9\")*INDIRECT($B$1&\"!$C$20\")*B387))),\"\")","v":""},{"$f":"(INDIRECT($B$1&\"!$F$15\") -D387)/C387","v":{"$error":"#VALUE!"}},{"$f":"IF(ISNUMBER(E387),E387*INDIRECT($B$1&\"!$F$9\")/$G$3,\"\")","v":""},"",{"$f":"IF(B387<INDIRECT($B$1&\"!$C$7\"),H386-G387,\"\")","v":""}]
[null,{"$f":"IF(ISNUMBER(B387),IF(AND(B387<INDIRECT($B$1&\"!$C$7\"),H387>0), B387+0.5,\"\"),\"\")","v":""},"",{"$f":"IF(AND(B388<INDIRECT($B$1&\"!$C$7\"),ISNUMBER(B388)),INDIRECT($B$1&\"!$C$16\")*ERFC(0.5*C388*SQRT(INDIRECT($B$1&\"!$F$10\")/(INDIRECT($B$1&\"!$F$9\")*INDIRECT($B$1&\"!$C$20\")*B388))),\"\")","v":""},{"$f":"(INDIRECT($B$1&\"!$F$15\") -D388)/C388","v":{"$error":"#VALUE!"}},{"$f":"IF(ISNUMBER(E388),E388*INDIRECT($B$1&\"!$F$9\")/$G$3,\"\")","v":""},"",{"$f":"IF(B388<INDIRECT($B$1&\"!$C$7\"),H387-G388,\"\")","v":""}]
[null,{"$f":"IF(ISNUMBER(B388),IF(AND(B388<INDIRECT($B$1&\"!$C$7\"),H388>0), B388+0.5,\"\"),\"\")","v":""},"",{"$f":"IF(AND(B389<INDIRECT($B$1&\"!$C$7\"),ISNUMBER(B389)),INDIRECT($B$1&\"!$C$16\")*ERFC(0.5*C389*SQRT(INDIRECT($B$1&\"!$F$10\")/(INDIRECT($B$1&\"!$F$9\")*INDIRECT($B$1&\"!$C$20\")*B389))),\"\")","v":""},{"$f":"(INDIRECT($B$1&\"!$F$15\") -D389)/C389","v":{"$error":"#VALUE!"}},{"$f":"IF(ISNUMBER(E389),E389*INDIRECT($B$1&\"!$F$9\")/$G$3,\"\")","v":""},"",{"$f":"IF(B389<INDIRECT($B$1&\"!$C$7\"),H388-G389,\"\")","v":""}]
[null,{"$f":"IF(ISNUMBER(B389),IF(AND(B389<INDIRECT($B$1&\"!$C$7\"),H389>0), B389+0.5,\"\"),\"\")","v":""},"",{"$f":"IF(AND(B390<INDIRECT($B$1&\"!$C$7\"),ISNUMBER(B390)),INDIRECT($B$1&\"!$C$16\")*ERFC(0.5*C390*SQRT(INDIRECT($B$1&\"!$F$10\")/(INDIRECT($B$1&\"!$F$9\")*INDIRECT($B$1&\"!$C$20\")*B390))),\"\")","v":""},{"$f":"(INDIRECT($B$1&\"!$F$15\") -D390)/C390","v":{"$error":"#VALUE!"}},{"$f":"IF(ISNUMBER(E390),E390*INDIRECT($B$1&\"!$F$9\")/$G$3,\"\")","v":""},"",{"$f":"IF(B390<INDIRECT($B$1&\"!$C$7\"),H389-G390,\"\")","v":""}]
[null,{"$f":"IF(ISNUMBER(B390),IF(AND(B390<INDIRECT($B$1&\"!$C$7\"),H390>0), B390+0.5,\"\"),\"\")","v":""},"",{"$f":"IF(AND(B391<INDIRECT($B$1&\"!$C$7\"),ISNUMBER(B391)),INDIRECT($B$1&\"!$C$16\")*ERFC(0.5*C391*SQRT(INDIRECT($B$1&\"!$F$10\")/(INDIRECT($B$1&\"!$F$9\")*INDIRECT($B$1&\"!$C$20\")*B391))),\"\")","v":""},{"$f":"(INDIRECT($B$1&\"!$F$15\") -D391)/C391","v":{"$error":"#VALUE!"}},{"$f":"IF(ISNUMBER(E391),E391*INDIRECT($B$1&\"!$F$9\")/$G$3,\"\")","v":""},"",{"$f":"IF(B391<INDIRECT($B$1&\"!$C$7\"),H390-G391,\"\")","v":""}]
[null,{"$f":"IF(ISNUMBER(B391),IF(AND(B391<INDIRECT($B$1&\"!$C$7\"),H391>0), B391+0.5,\"\"),\"\")","v":""},"",{"$f":"IF(AND(B392<INDIRECT($B$1&\"!$C$7\"),ISNUMBER(B392)),INDIRECT($B$1&\"!$C$16\")*ERFC(0.5*C392*SQRT(INDIRECT($B$1&\"!$F$10\")/(INDIRECT($B$1&\"!$F$9\")*INDIRECT($B$1&\"!$C$20\")*B392))),\"\")","v":""},{"$f":"(INDIRECT($B$1&\"!$F$15\") -D392)/C392","v":{"$error":"#VALUE!"}},{"$f":"IF(ISNUMBER(E392),E392*INDIRECT($B$1&\"!$F$9\")/$G$3,\"\")","v":""},"",{"$f":"IF(B392<INDIRECT($B$1&\"!$C$7\"),H391-G392,\"\")","v":""}]
[null,{"$f":"IF(ISNUMBER(B392),IF(AND(B392<INDIRECT($B$1&\"!$C$7\"),H392>0), B392+0.5,\"\"),\"\")","v":""},"",{"$f":"IF(AND(B393<INDIRECT($B$1&\"!$C$7\"),ISNUMBER(B393)),INDIRECT($B$1&\"!$C$16\")*ERFC(0.5*C393*SQRT(INDIRECT($B$1&\"!$F$10\")/(INDIRECT($B$1&\"!$F$9\")*INDIRECT($B$1&\"!$C$20\")*B393))),\"\")","v":""},{"$f":"(INDIRECT($B$1&\"!$F$15\") -D393)/C393","v":{"$error":"#VALUE!"}},{"$f":"IF(ISNUMBER(E393),E393*INDIRECT($B$1&\"!$F$9\")/$G$3,\"\")","v":""},"",{"$f":"IF(B393<INDIRECT($B$1&\"!$C$7\"),H392-G393,\"\")","v":""}]
[null,{"$f":"IF(ISNUMBER(B393),IF(AND(B393<INDIRECT($B$1&\"!$C$7\"),H393>0), B393+0.5,\"\"),\"\")","v":""},"",{"$f":"IF(AND(B394<INDIRECT($B$1&\"!$C$7\"),ISNUMBER(B394)),INDIRECT($B$1&\"!$C$16\")*ERFC(0.5*C394*SQRT(INDIRECT($B$1&\"!$F$10\")/(INDIRECT($B$1&\"!$F$9\")*INDIRECT($B$1&\"!$C$20\")*B394))),\"\")","v":""},{"$f":"(INDIRECT($B$1&\"!$F$15\") -D394)/C394","v":{"$error":"#VALUE!"}},{"$f":"IF(ISNUMBER(E394),E394*INDIRECT($B$1&\"!$F$9\")/$G$3,\"\")","v":""},"",{"$f":"IF(B394<INDIRECT($B$1&\"!$C$7\"),H393-G394,\"\")","v":""}]
[null,{"$f":"IF(ISNUMBER(B394),IF(AND(B394<INDIRECT($B$1&\"!$C$7\"),H394>0), B394+0.5,\"\"),\"\")","v":""},"",{"$f":"IF(AND(B395<INDIRECT($B$1&\"!$C$7\"),ISNUMBER(B395)),INDIRECT($B$1&\"!$C$16\")*ERFC(0.5*C395*SQRT(INDIRECT($B$1&\"!$F$10\")/(INDIRECT($B$1&\"!$F$9\")*INDIRECT($B$1&\"!$C$20\")*B395))),\"\")","v":""},{"$f":"(INDIRECT($B$1&\"!$F$15\") -D395)/C395","v":{"$error":"#VALUE!"}},{"$f":"IF(ISNUMBER(E395),E395*INDIRECT($B$1&\"!$F$9\")/$G$3,\"\")","v":""},"",{"$f":"IF(B395<INDIRECT($B$1&\"!$C$7\"),H394-G395,\"\")","v":""}]
[null,{"$f":"IF(ISNUMBER(B395),IF(AND(B395<INDIRECT($B$1&\"!$C$7\"),H395>0), B395+0.5,\"\"),\"\")","v":""},"",{"$f":"IF(AND(B396<INDIRECT($B$1&\"!$C$7\"),ISNUMBER(B396)),INDIRECT($B$1&\"!$C$16\")*ERFC(0.5*C396*SQRT(INDIRECT($B$1&\"!$F$10\")/(INDIRECT($B$1&\"!$F$9\")*INDIRECT($B$1&\"!$C$20\")*B396))),\"\")","v":""},{"$f":"(INDIRECT($B$1&\"!$F$15\") -D396)/C396","v":{"$error":"#VALUE!"}},{"$f":"IF(ISNUMBER(E396),E396*INDIRECT($B$1&\"!$F$9\")/$G$3,\"\")","v":""},"",{"$f":"IF(B396<INDIRECT($B$1&\"!$C$7\"),H395-G396,\"\")","v":""}]
[null,{"$f":"IF(ISNUMBER(B396),IF(AND(B396<INDIRECT($B$1&\"!$C$7\"),H396>0), B396+0.5,\"\"),\"\")","v":""},"",{"$f":"IF(AND(B397<INDIRECT($B$1&\"!$C$7\"),ISNUMBER(B397)),INDIRECT($B$1&\"!$C$16\")*ERFC(0.5*C397*SQRT(INDIRECT($B$1&\"!$F$10\")/(INDIRECT($B$1&\"!$F$9\")*INDIRECT($B$1&\"!$C$20\")*B397))),\"\")","v":""},{"$f":"(INDIRECT($B$1&\"!$F$15\") -D397)/C397","v":{"$error":"#VALUE!"}},{"$f":"IF(ISNUMBER(E397),E397*INDIRECT($B$1&\"!$F$9\")/$G$3,\"\")","v":""},"",{"$f":"IF(B397<INDIRECT($B$1&\"!$C$7\"),H396-G397,\"\")","v":""}]
[null,{"$f":"IF(ISNUMBER(B397),IF(AND(B397<INDIRECT($B$1&\"!$C$7\"),H397>0), B397+0.5,\"\"),\"\")","v":""},"",{"$f":"IF(AND(B398<INDIRECT($B$1&\"!$C$7\"),ISNUMBER(B398)),INDIRECT($B$1&\"!$C$16\")*ERFC(0.5*C398*SQRT(INDIRECT($B$1&\"!$F$10\")/(INDIRECT($B$1&\"!$F$9\")*INDIRECT($B$1&\"!$C$20\")*B398))),\"\")","v":""},{"$f":"(INDIRECT($B$1&\"!$F$15\") -D398)/C398","v":{"$error":"#VALUE!"}},{"$f":"IF(ISNUMBER(E398),E398*INDIRECT($B$1&\"!$F$9\")/$G$3,\"\")","v":""},"",{"$f":"IF(B398<INDIRECT($B$1&\"!$C$7\"),H397-G398,\"\")","v":""}]
[null,{"$f":"IF(ISNUMBER(B398),IF(AND(B398<INDIRECT($B$1&\"!$C$7\"),H398>0), B398+0.5,\"\"),\"\")","v":""},"",{"$f":"IF(AND(B399<INDIRECT($B$1&\"!$C$7\"),ISNUMBER(B399)),INDIRECT($B$1&\"!$C$16\")*ERFC(0.5*C399*SQRT(INDIRECT($B$1&\"!$F$10\")/(INDIRECT($B$1&\"!$F$9\")*INDIRECT($B$1&\"!$C$20\")*B399))),\"\")","v":""},{"$f":"(INDIRECT($B$1&\"!$F$15\") -D399)/C399","v":{"$error":"#VALUE!"}},{"$f":"IF(ISNUMBER(E399),E399*INDIRECT($B$1&\"!$F$9\")/$G$3,\"\")","v":""},"",{"$f":"IF(B399<INDIRECT($B$1&\"!$C$7\"),H398-G399,\"\")","v":""}]
[null,{"$f":"IF(ISNUMBER(B399),IF(AND(B399<INDIRECT($B$1&\"!$C$7\"),H399>0), B399+0.5,\"\"),\"\")","v":""},"",{"$f":"IF(AND(B400<INDIRECT($B$1&\"!$C$7\"),ISNUMBER(B400)),INDIRECT($B$1&\"!$C$16\")*ERFC(0.5*C400*SQRT(INDIRECT($B$1&\"!$F$10\")/(INDIRECT($B$1&\"!$F$9\")*INDIRECT($B$1&\"!$C$20\")*B400))),\"\")","v":""},{"$f":"(INDIRECT($B$1&\"!$F$15\") -D400)/C400","v":{"$error":"#VALUE!"}},{"$f":"IF(ISNUMBER(E400),E400*INDIRECT($B$1&\"!$F$9\")/$G$3,\"\")","v":""},"",{"$f":"IF(B400<INDIRECT($B$1&\"!$C$7\"),H399-G400,\"\")","v":""}]
[null,{"$f":"IF(ISNUMBER(B400),IF(AND(B400<INDIRECT($B$1&\"!$C$7\"),H400>0), B400+0.5,\"\"),\"\")","v":""},"",{"$f":"IF(AND(B401<INDIRECT($B$1&\"!$C$7\"),ISNUMBER(B401)),INDIRECT($B$1&\"!$C$16\")*ERFC(0.5*C401*SQRT(INDIRECT($B$1&\"!$F$10\")/(INDIRECT($B$1&\"!$F$9\")*INDIRECT($B$1&\"!$C$20\")*B401))),\"\")","v":""},{"$f":"(INDIRECT($B$1&\"!$F$15\") -D401)/C401","v":{"$error":"#VALUE!"}},{"$f":"IF(ISNUMBER(E401),E401*INDIRECT($B$1&\"!$F$9\")/$G$3,\"\")","v":""},"",{"$f":"IF(B401<INDIRECT($B$1&\"!$C$7\"),H400-G401,\"\")","v":""}]
[null,{"$f":"IF(ISNUMBER(B401),IF(AND(B401<INDIRECT($B$1&\"!$C$7\"),H401>0), B401+0.5,\"\"),\"\")","v":""},"",{"$f":"IF(AND(B402<INDIRECT($B$1&\"!$C$7\"),ISNUMBER(B402)),INDIRECT($B$1&\"!$C$16\")*ERFC(0.5*C402*SQRT(INDIRECT($B$1&\"!$F$10\")/(INDIRECT($B$1&\"!$F$9\")*INDIRECT($B$1&\"!$C$20\")*B402))),\"\")","v":""},{"$f":"(INDIRECT($B$1&\"!$F$15\") -D402)/C402","v":{"$error":"#VALUE!"}},{"$f":"IF(ISNUMBER(E402),E402*INDIRECT($B$1&\"!$F$9\")/$G$3,\"\")","v":""},"",{"$f":"IF(B402<INDIRECT($B$1&\"!$C$7\"),H401-G402,\"\")","v":""}]
[null,{"$f":"IF(ISNUMBER(B402),IF(AND(B402<INDIRECT($B$1&\"!$C$7\"),H402>0), B402+0.5,\"\"),\"\")","v":""},"",{"$f":"IF(AND(B403<INDIRECT($B$1&\"!$C$7\"),ISNUMBER(B403)),INDIRECT($B$1&\"!$C$16\")*ERFC(0.5*C403*SQRT(INDIRECT($B$1&\"!$F$10\")/(INDIRECT($B$1&\"!$F$9\")*INDIRECT($B$1&\"!$C$20\")*B403))),\"\")","v":""},{"$f":"(INDIRECT($B$1&\"!$F$15\") -D403)/C403","v":{"$error":"#VALUE!"}},{"$f":"IF(ISNUMBER(E403),E403*INDIRECT($B$1&\"!$F$9\")/$G$3,\"\")","v":""},"",{"$f":"IF(B403<INDIRECT($B$1&\"!$C$7\"),H402-G403,\"\")","v":""}]
[null,{"$f":"IF(ISNUMBER(B403),IF(AND(B403<INDIRECT($B$1&\"!$C$7\"),H403>0), B403+0.5,\"\"),\"\")","v":""},"",{"$f":"IF(AND(B404<INDIRECT($B$1&\"!$C$7\"),ISNUMBER(B404)),INDIRECT($B$1&\"!$C$16\")*ERFC(0.5*C404*SQRT(INDIRECT($B$1&\"!$F$10\")/(INDIRECT($B$1&\"!$F$9\")*INDIRECT($B$1&\"!$C$20\")*B404))),\"\")","v":""},{"$f":"(INDIRECT($B$1&\"!$F$15\") -D404)/C404","v":{"$error":"#VALUE!"}},{"$f":"IF(ISNUMBER(E404),E404*INDIRECT($B$1&\"!$F$9\")/$G$3,\"\")","v":""},"",{"$f":"IF(B404<INDIRECT($B$1&\"!$C$7\"),H403-G404,\"\")","v":""}]
[null,{"$f":"IF(ISNUMBER(B404),IF(AND(B404<INDIRECT($B$1&\"!$C$7\"),H404>0), B404+0.5,\"\"),\"\")","v":""},"",{"$f":"IF(AND(B405<INDIRECT($B$1&\"!$C$7\"),ISNUMBER(B405)),INDIRECT($B$1&\"!$C$16\")*ERFC(0.5*C405*SQRT(INDIRECT($B$1&\"!$F$10\")/(INDIRECT($B$1&\"!$F$9\")*INDIRECT($B$1&\"!$C$20\")*B405))),\"\")","v":""},{"$f":"(INDIRECT($B$1&\"!$F$15\") -D405)/C405","v":{"$error":"#VALUE!"}},{"$f":"IF(ISNUMBER(E405),E405*INDIRECT($B$1&\"!$F$9\")/$G$3,\"\")","v":""},"",{"$f":"IF(B405<INDIRECT($B$1&\"!$C$7\"),H404-G405,\"\")","v":""}]
[null,{"$f":"IF(ISNUMBER(B405),IF(AND(B405<INDIRECT($B$1&\"!$C$7\"),H405>0), B405+0.5,\"\"),\"\")","v":""},"",{"$f":"IF(AND(B406<INDIRECT($B$1&\"!$C$7\"),ISNUMBER(B406)),INDIRECT($B$1&\"!$C$16\")*ERFC(0.5*C406*SQRT(INDIRECT($B$1&\"!$F$10\")/(INDIRECT($B$1&\"!$F$9\")*INDIRECT($B$1&\"!$C$20\")*B406))),\"\")","v":""},{"$f":"(INDIRECT($B$1&\"!$F$15\") -D406)/C406","v":{"$error":"#VALUE!"}},{"$f":"IF(ISNUMBER(E406),E406*INDIRECT($B$1&\"!$F$9\")/$G$3,\"\")","v":""},"",{"$f":"IF(B406<INDIRECT($B$1&\"!$C$7\"),H405-G406,\"\")","v":""}]
[null,{"$f":"IF(ISNUMBER(B406),IF(AND(B406<INDIRECT($B$1&\"!$C$7\"),H406>0), B406+0.5,\"\"),\"\")","v":""},"",{"$f":"IF(AND(B407<INDIRECT($B$1&\"!$C$7\"),ISNUMBER(B407)),INDIRECT($B$1&\"!$C$16\")*ERFC(0.5*C407*SQRT(INDIRECT($B$1&\"!$F$10\")/(INDIRECT($B$1&\"!$F$9\")*INDIRECT($B$1&\"!$C$20\")*B407))),\"\")","v":""},{"$f":"(INDIRECT($B$1&\"!$F$15\") -D407)/C407","v":{"$error":"#VALUE!"}},{"$f":"IF(ISNUMBER(E407),E407*INDIRECT($B$1&\"!$F$9\")/$G$3,\"\")","v":""},"",{"$f":"IF(B407<INDIRECT($B$1&\"!$C$7\"),H406-G407,\"\")","v":""}]
[null,{"$f":"IF(ISNUMBER(B407),IF(AND(B407<INDIRECT($B$1&\"!$C$7\"),H407>0), B407+0.5,\"\"),\"\")","v":""},"",{"$f":"IF(AND(B408<INDIRECT($B$1&\"!$C$7\"),ISNUMBER(B408)),INDIRECT($B$1&\"!$C$16\")*ERFC(0.5*C408*SQRT(INDIRECT($B$1&\"!$F$10\")/(INDIRECT($B$1&\"!$F$9\")*INDIRECT($B$1&\"!$C$20\")*B408))),\"\")","v":""},{"$f":"(INDIRECT($B$1&\"!$F$15\") -D408)/C408","v":{"$error":"#VALUE!"}},{"$f":"IF(ISNUMBER(E408),E408*INDIRECT($B$1&\"!$F$9\")/$G$3,\"\")","v":""},"",{"$f":"IF(B408<INDIRECT($B$1&\"!$C$7\"),H407-G408,\"\")","v":""}]
[null,{"$f":"IF(ISNUMBER(B408),IF(AND(B408<INDIRECT($B$1&\"!$C$7\"),H408>0), B408+0.5,\"\"),\"\")","v":""},"",{"$f":"IF(AND(B409<INDIRECT($B$1&\"!$C$7\"),ISNUMBER(B409)),INDIRECT($B$1&\"!$C$16\")*ERFC(0.5*C409*SQRT(INDIRECT($B$1&\"!$F$10\")/(INDIRECT($B$1&\"!$F$9\")*INDIRECT($B$1&\"!$C$20\")*B409))),\"\")","v":""},{"$f":"(INDIRECT($B$1&\"!$F$15\") -D409)/C409","v":{"$error":"#VALUE!"}},{"$f":"IF(ISNUMBER(E409),E409*INDIRECT($B$1&\"!$F$9\")/$G$3,\"\")","v":""},"",{"$f":"IF(B409<INDIRECT($B$1&\"!$C$7\"),H408-G409,\"\")","v":""}]
[null,{"$f":"IF(ISNUMBER(B409),IF(AND(B409<INDIRECT($B$1&\"!$C$7\"),H409>0), B409+0.5,\"\"),\"\")","v":""},"",{"$f":"IF(AND(B410<INDIRECT($B$1&\"!$C$7\"),ISNUMBER(B410)),INDIRECT($B$1&\"!$C$16\")*ERFC(0.5*C410*SQRT(INDIRECT($B$1&\"!$F$10\")/(INDIRECT($B$1&\"!$F$9\")*INDIRECT($B$1&\"!$C$20\")*B410))),\"\")","v":""},{"$f":"(INDIRECT($B$1&\"!$F$15\") -D410)/C410","v":{"$error":"#VALUE!"}},{"$f":"IF(ISNUMBER(E410),E410*INDIRECT($B$1&\"!$F$9\")/$G$3,\"\")","v":""},"",{"$f":"IF(B410<INDIRECT($B$1&\"!$C$7\"),H409-G410,\"\")","v":""}]
[null,{"$f":"IF(ISNUMBER(B410),IF(AND(B410<INDIRECT($B$1&\"!$C$7\"),H410>0), B410+0.5,\"\"),\"\")","v":""},"",{"$f":"IF(AND(B411<INDIRECT($B$1&\"!$C$7\"),ISNUMBER(B411)),INDIRECT($B$1&\"!$C$16\")*ERFC(0.5*C411*SQRT(INDIRECT($B$1&\"!$F$10\")/(INDIRECT($B$1&\"!$F$9\")*INDIRECT($B$1&\"!$C$20\")*B411))),\"\")","v":""},{"$f":"(INDIRECT($B$1&\"!$F$15\") -D411)/C411","v":{"$error":"#VALUE!"}},{"$f":"IF(ISNUMBER(E411),E411*INDIRECT($B$1&\"!$F$9\")/$G$3,\"\")","v":""},"",{"$f":"IF(B411<INDIRECT($B$1&\"!$C$7\"),H410-G411,\"\")","v":""}]
[null,{"$f":"IF(ISNUMBER(B411),IF(AND(B411<INDIRECT($B$1&\"!$C$7\"),H411>0), B411+0.5,\"\"),\"\")","v":""},"",{"$f":"IF(AND(B412<INDIRECT($B$1&\"!$C$7\"),ISNUMBER(B412)),INDIRECT($B$1&\"!$C$16\")*ERFC(0.5*C412*SQRT(INDIRECT($B$1&\"!$F$10\")/(INDIRECT($B$1&\"!$F$9\")*INDIRECT($B$1&\"!$C$20\")*B412))),\"\")","v":""},{"$f":"(INDIRECT($B$1&\"!$F$15\") -D412)/C412","v":{"$error":"#VALUE!"}},{"$f":"IF(ISNUMBER(E412),E412*INDIRECT($B$1&\"!$F$9\")/$G$3,\"\")","v":""},"",{"$f":"IF(B412<INDIRECT($B$1&\"!$C$7\"),H411-G412,\"\")","v":""}]
[null,{"$f":"IF(ISNUMBER(B412),IF(AND(B412<INDIRECT($B$1&\"!$C$7\"),H412>0), B412+0.5,\"\"),\"\")","v":""},"",{"$f":"IF(AND(B413<INDIRECT($B$1&\"!$C$7\"),ISNUMBER(B413)),INDIRECT($B$1&\"!$C$16\")*ERFC(0.5*C413*SQRT(INDIRECT($B$1&\"!$F$10\")/(INDIRECT($B$1&\"!$F$9\")*INDIRECT($B$1&\"!$C$20\")*B413))),\"\")","v":""},{"$f":"(INDIRECT($B$1&\"!$F$15\") -D413)/C413","v":{"$error":"#VALUE!"}},{"$f":"IF(ISNUMBER(E413),E413*INDIRECT($B$1&\"!$F$9\")/$G$3,\"\")","v":""},"",{"$f":"IF(B413<INDIRECT($B$1&\"!$C$7\"),H412-G413,\"\")","v":""}]
[null,{"$f":"IF(ISNUMBER(B413),IF(AND(B413<INDIRECT($B$1&\"!$C$7\"),H413>0), B413+0.5,\"\"),\"\")","v":""},"",{"$f":"IF(AND(B414<INDIRECT($B$1&\"!$C$7\"),ISNUMBER(B414)),INDIRECT($B$1&\"!$C$16\")*ERFC(0.5*C414*SQRT(INDIRECT($B$1&\"!$F$10\")/(INDIRECT($B$1&\"!$F$9\")*INDIRECT($B$1&\"!$C$20\")*B414))),\"\")","v":""},{"$f":"(INDIRECT($B$1&\"!$F$15\") -D414)/C414","v":{"$error":"#VALUE!"}},{"$f":"IF(ISNUMBER(E414),E414*INDIRECT($B$1&\"!$F$9\")/$G$3,\"\")","v":""},"",{"$f":"IF(B414<INDIRECT($B$1&\"!$C$7\"),H413-G414,\"\")","v":""}]
[null,{"$f":"IF(ISNUMBER(B414),IF(AND(B414<INDIRECT($B$1&\"!$C$7\"),H414>0), B414+0.5,\"\"),\"\")","v":""},"",{"$f":"IF(AND(B415<INDIRECT($B$1&\"!$C$7\"),ISNUMBER(B415)),INDIRECT($B$1&\"!$C$16\")*ERFC(0.5*C415*SQRT(INDIRECT($B$1&\"!$F$10\")/(INDIRECT($B$1&\"!$F$9\")*INDIRECT($B$1&\"!$C$20\")*B415))),\"\")","v":""},{"$f":"(INDIRECT($B$1&\"!$F$15\") -D415)/C415","v":{"$error":"#VALUE!"}},{"$f":"IF(ISNUMBER(E415),E415*INDIRECT($B$1&\"!$F$9\")/$G$3,\"\")","v":""},"",{"$f":"IF(B415<INDIRECT($B$1&\"!$C$7\"),H414-G415,\"\")","v":""}]
[null,{"$f":"IF(ISNUMBER(B415),IF(AND(B415<INDIRECT($B$1&\"!$C$7\"),H415>0), B415+0.5,\"\"),\"\")","v":""},"",{"$f":"IF(AND(B416<INDIRECT($B$1&\"!$C$7\"),ISNUMBER(B416)),INDIRECT($B$1&\"!$C$16\")*ERFC(0.5*C416*SQRT(INDIRECT($B$1&\"!$F$10\")/(INDIRECT($B$1&\"!$F$9\")*INDIRECT($B$1&\"!$C$20\")*B416))),\"\")","v":""},{"$f":"(INDIRECT($B$1&\"!$F$15\") -D416)/C416","v":{"$error":"#VALUE!"}},{"$f":"IF(ISNUMBER(E416),E416*INDIRECT($B$1&\"!$F$9\")/$G$3,\"\")","v":""},"",{"$f":"IF(B416<INDIRECT($B$1&\"!$C$7\"),H415-G416,\"\")","v":""}]
[null,{"$f":"IF(ISNUMBER(B416),IF(AND(B416<INDIRECT($B$1&\"!$C$7\"),H416>0), B416+0.5,\"\"),\"\")","v":""},"",{"$f":"IF(AND(B417<INDIRECT($B$1&\"!$C$7\"),ISNUMBER(B417)),INDIRECT($B$1&\"!$C$16\")*ERFC(0.5*C417*SQRT(INDIRECT($B$1&\"!$F$10\")/(INDIRECT($B$1&\"!$F$9\")*INDIRECT($B$1&\"!$C$20\")*B417))),\"\")","v":""},{"$f":"(INDIRECT($B$1&\"!$F$15\") -D417)/C417","v":{"$error":"#VALUE!"}},{"$f":"IF(ISNUMBER(E417),E417*INDIRECT($B$1&\"!$F$9\")/$G$3,\"\")","v":""},"",{"$f":"IF(B417<INDIRECT($B$1&\"!$C$7\"),H416-G417,\"\")","v":""}]
[null,{"$f":"IF(ISNUMBER(B417),IF(AND(B417<INDIRECT($B$1&\"!$C$7\"),H417>0), B417+0.5,\"\"),\"\")","v":""},"",{"$f":"IF(AND(B418<INDIRECT($B$1&\"!$C$7\"),ISNUMBER(B418)),INDIRECT($B$1&\"!$C$16\")*ERFC(0.5*C418*SQRT(INDIRECT($B$1&\"!$F$10\")/(INDIRECT($B$1&\"!$F$9\")*INDIRECT($B$1&\"!$C$20\")*B418))),\"\")","v":""},{"$f":"(INDIRECT($B$1&\"!$F$15\") -D418)/C418","v":{"$error":"#VALUE!"}},{"$f":"IF(ISNUMBER(E418),E418*INDIRECT($B$1&\"!$F$9\")/$G$3,\"\")","v":""},"",{"$f":"IF(B418<INDIRECT($B$1&\"!$C$7\"),H417-G418,\"\")","v":""}]
[null,{"$f":"IF(ISNUMBER(B418),IF(AND(B418<INDIRECT($B$1&\"!$C$7\"),H418>0), B418+0.5,\"\"),\"\")","v":""},"",{"$f":"IF(AND(B419<INDIRECT($B$1&\"!$C$7\"),ISNUMBER(B419)),INDIRECT($B$1&\"!$C$16\")*ERFC(0.5*C419*SQRT(INDIRECT($B$1&\"!$F$10\")/(INDIRECT($B$1&\"!$F$9\")*INDIRECT($B$1&\"!$C$20\")*B419))),\"\")","v":""},{"$f":"(INDIRECT($B$1&\"!$F$15\") -D419)/C419","v":{"$error":"#VALUE!"}},{"$f":"IF(ISNUMBER(E419),E419*INDIRECT($B$1&\"!$F$9\")/$G$3,\"\")","v":""},"",{"$f":"IF(B419<INDIRECT($B$1&\"!$C$7\"),H418-G419,\"\")","v":""}]
[null,{"$f":"IF(ISNUMBER(B419),IF(AND(B419<INDIRECT($B$1&\"!$C$7\"),H419>0), B419+0.5,\"\"),\"\")","v":""},"",{"$f":"IF(AND(B420<INDIRECT($B$1&\"!$C$7\"),ISNUMBER(B420)),INDIRECT($B$1&\"!$C$16\")*ERFC(0.5*C420*SQRT(INDIRECT($B$1&\"!$F$10\")/(INDIRECT($B$1&\"!$F$9\")*INDIRECT($B$1&\"!$C$20\")*B420))),\"\")","v":""},{"$f":"(INDIRECT($B$1&\"!$F$15\") -D420)/C420","v":{"$error":"#VALUE!"}},{"$f":"IF(ISNUMBER(E420),E420*INDIRECT($B$1&\"!$F$9\")/$G$3,\"\")","v":""},"",{"$f":"IF(B420<INDIRECT($B$1&\"!$C$7\"),H419-G420,\"\")","v":""}]
[null,{"$f":"IF(ISNUMBER(B420),IF(AND(B420<INDIRECT($B$1&\"!$C$7\"),H420>0), B420+0.5,\"\"),\"\")","v":""},"",{"$f":"IF(AND(B421<INDIRECT($B$1&\"!$C$7\"),ISNUMBER(B421)),INDIRECT($B$1&\"!$C$16\")*ERFC(0.5*C421*SQRT(INDIRECT($B$1&\"!$F$10\")/(INDIRECT($B$1&\"!$F$9\")*INDIRECT($B$1&\"!$C$20\")*B421))),\"\")","v":""},{"$f":"(INDIRECT($B$1&\"!$F$15\") -D421)/C421","v":{"$error":"#VALUE!"}},{"$f":"IF(ISNUMBER(E421),E421*INDIRECT($B$1&\"!$F$9\")/$G$3,\"\")","v":""},"",{"$f":"IF(B421<INDIRECT($B$1&\"!$C$7\"),H420-G421,\"\")","v":""}]
[null,{"$f":"IF(ISNUMBER(B421),IF(AND(B421<INDIRECT($B$1&\"!$C$7\"),H421>0), B421+0.5,\"\"),\"\")","v":""},"",{"$f":"IF(AND(B422<INDIRECT($B$1&\"!$C$7\"),ISNUMBER(B422)),INDIRECT($B$1&\"!$C$16\")*ERFC(0.5*C422*SQRT(INDIRECT($B$1&\"!$F$10\")/(INDIRECT($B$1&\"!$F$9\")*INDIRECT($B$1&\"!$C$20\")*B422))),\"\")","v":""},{"$f":"(INDIRECT($B$1&\"!$F$15\") -D422)/C422","v":{"$error":"#VALUE!"}},{"$f":"IF(ISNUMBER(E422),E422*INDIRECT($B$1&\"!$F$9\")/$G$3,\"\")","v":""},"",{"$f":"IF(B422<INDIRECT($B$1&\"!$C$7\"),H421-G422,\"\")","v":""}]
[null,{"$f":"IF(ISNUMBER(B422),IF(AND(B422<INDIRECT($B$1&\"!$C$7\"),H422>0), B422+0.5,\"\"),\"\")","v":""},"",{"$f":"IF(AND(B423<INDIRECT($B$1&\"!$C$7\"),ISNUMBER(B423)),INDIRECT($B$1&\"!$C$16\")*ERFC(0.5*C423*SQRT(INDIRECT($B$1&\"!$F$10\")/(INDIRECT($B$1&\"!$F$9\")*INDIRECT($B$1&\"!$C$20\")*B423))),\"\")","v":""},{"$f":"(INDIRECT($B$1&\"!$F$15\") -D423)/C423","v":{"$error":"#VALUE!"}},{"$f":"IF(ISNUMBER(E423),E423*INDIRECT($B$1&\"!$F$9\")/$G$3,\"\")","v":""},"",{"$f":"IF(B423<INDIRECT($B$1&\"!$C$7\"),H422-G423,\"\")","v":""}]
[null,{"$f":"IF(ISNUMBER(B423),IF(AND(B423<INDIRECT($B$1&\"!$C$7\"),H423>0), B423+0.5,\"\"),\"\")","v":""},"",{"$f":"IF(AND(B424<INDIRECT($B$1&\"!$C$7\"),ISNUMBER(B424)),INDIRECT($B$1&\"!$C$16\")*ERFC(0.5*C424*SQRT(INDIRECT($B$1&\"!$F$10\")/(INDIRECT($B$1&\"!$F$9\")*INDIRECT($B$1&\"!$C$20\")*B424))),\"\")","v":""},{"$f":"(INDIRECT($B$1&\"!$F$15\") -D424)/C424","v":{"$error":"#VALUE!"}},{"$f":"IF(ISNUMBER(E424),E424*INDIRECT($B$1&\"!$F$9\")/$G$3,\"\")","v":""},"",{"$f":"IF(B424<INDIRECT($B$1&\"!$C$7\"),H423-G424,\"\")","v":""}]
[null,{"$f":"IF(ISNUMBER(B424),IF(AND(B424<INDIRECT($B$1&\"!$C$7\"),H424>0), B424+0.5,\"\"),\"\")","v":""},"",{"$f":"IF(AND(B425<INDIRECT($B$1&\"!$C$7\"),ISNUMBER(B425)),INDIRECT($B$1&\"!$C$16\")*ERFC(0.5*C425*SQRT(INDIRECT($B$1&\"!$F$10\")/(INDIRECT($B$1&\"!$F$9\")*INDIRECT($B$1&\"!$C$20\")*B425))),\"\")","v":""},{"$f":"(INDIRECT($B$1&\"!$F$15\") -D425)/C425","v":{"$error":"#VALUE!"}},{"$f":"IF(ISNUMBER(E425),E425*INDIRECT($B$1&\"!$F$9\")/$G$3,\"\")","v":""},"",{"$f":"IF(B425<INDIRECT($B$1&\"!$C$7\"),H424-G425,\"\")","v":""}]
[null,{"$f":"IF(ISNUMBER(B425),IF(AND(B425<INDIRECT($B$1&\"!$C$7\"),H425>0), B425+0.5,\"\"),\"\")","v":""},"",{"$f":"IF(AND(B426<INDIRECT($B$1&\"!$C$7\"),ISNUMBER(B426)),INDIRECT($B$1&\"!$C$16\")*ERFC(0.5*C426*SQRT(INDIRECT($B$1&\"!$F$10\")/(INDIRECT($B$1&\"!$F$9\")*INDIRECT($B$1&\"!$C$20\")*B426))),\"\")","v":""},{"$f":"(INDIRECT($B$1&\"!$F$15\") -D426)/C426","v":{"$error":"#VALUE!"}},{"$f":"IF(ISNUMBER(E426),E426*INDIRECT($B$1&\"!$F$9\")/$G$3,\"\")","v":""},"",{"$f":"IF(B426<INDIRECT($B$1&\"!$C$7\"),H425-G426,\"\")","v":""}]
[null,{"$f":"IF(ISNUMBER(B426),IF(AND(B426<INDIRECT($B$1&\"!$C$7\"),H426>0), B426+0.5,\"\"),\"\")","v":""},"",{"$f":"IF(AND(B427<INDIRECT($B$1&\"!$C$7\"),ISNUMBER(B427)),INDIRECT($B$1&\"!$C$16\")*ERFC(0.5*C427*SQRT(INDIRECT($B$1&\"!$F$10\")/(INDIRECT($B$1&\"!$F$9\")*INDIRECT($B$1&\"!$C$20\")*B427))),\"\")","v":""},{"$f":"(INDIRECT($B$1&\"!$F$15\") -D427)/C427","v":{"$error":"#VALUE!"}},{"$f":"IF(ISNUMBER(E427),E427*INDIRECT($B$1&\"!$F$9\")/$G$3,\"\")","v":""},"",{"$f":"IF(B427<INDIRECT($B$1&\"!$C$7\"),H426-G427,\"\")","v":""}]
[null,{"$f":"IF(ISNUMBER(B427),IF(AND(B427<INDIRECT($B$1&\"!$C$7\"),H427>0), B427+0.5,\"\"),\"\")","v":""},"",{"$f":"IF(AND(B428<INDIRECT($B$1&\"!$C$7\"),ISNUMBER(B428)),INDIRECT($B$1&\"!$C$16\")*ERFC(0.5*C428*SQRT(INDIRECT($B$1&\"!$F$10\")/(INDIRECT($B$1&\"!$F$9\")*INDIRECT($B$1&\"!$C$20\")*B428))),\"\")","v":""},{"$f":"(INDIRECT($B$1&\"!$F$15\") -D428)/C428","v":{"$error":"#VALUE!"}},{"$f":"IF(ISNUMBER(E428),E428*INDIRECT($B$1&\"!$F$9\")/$G$3,\"\")","v":""},"",{"$f":"IF(B428<INDIRECT($B$1&\"!$C$7\"),H427-G428,\"\")","v":""}]
[null,{"$f":"IF(ISNUMBER(B428),IF(AND(B428<INDIRECT($B$1&\"!$C$7\"),H428>0), B428+0.5,\"\"),\"\")","v":""},"",{"$f":"IF(AND(B429<INDIRECT($B$1&\"!$C$7\"),ISNUMBER(B429)),INDIRECT($B$1&\"!$C$16\")*ERFC(0.5*C429*SQRT(INDIRECT($B$1&\"!$F$10\")/(INDIRECT($B$1&\"!$F$9\")*INDIRECT($B$1&\"!$C$20\")*B429))),\"\")","v":""},{"$f":"(INDIRECT($B$1&\"!$F$15\") -D429)/C429","v":{"$error":"#VALUE!"}},{"$f":"IF(ISNUMBER(E429),E429*INDIRECT($B$1&\"!$F$9\")/$G$3,\"\")","v":""},"",{"$f":"IF(B429<INDIRECT($B$1&\"!$C$7\"),H428-G429,\"\")","v":""}]
[null,{"$f":"IF(ISNUMBER(B429),IF(AND(B429<INDIRECT($B$1&\"!$C$7\"),H429>0), B429+0.5,\"\"),\"\")","v":""},"",{"$f":"IF(AND(B430<INDIRECT($B$1&\"!$C$7\"),ISNUMBER(B430)),INDIRECT($B$1&\"!$C$16\")*ERFC(0.5*C430*SQRT(INDIRECT($B$1&\"!$F$10\")/(INDIRECT($B$1&\"!$F$9\")*INDIRECT($B$1&\"!$C$20\")*B430))),\"\")","v":""},{"$f":"(INDIRECT($B$1&\"!$F$15\") -D430)/C430","v":{"$error":"#VALUE!"}},{"$f":"IF(ISNUMBER(E430),E430*INDIRECT($B$1&\"!$F$9\")/$G$3,\"\")","v":""},"",{"$f":"IF(B430<INDIRECT($B$1&\"!$C$7\"),H429-G430,\"\")","v":""}]
[null,{"$f":"IF(ISNUMBER(B430),IF(AND(B430<INDIRECT($B$1&\"!$C$7\"),H430>0), B430+0.5,\"\"),\"\")","v":""},"",{"$f":"IF(AND(B431<INDIRECT($B$1&\"!$C$7\"),ISNUMBER(B431)),INDIRECT($B$1&\"!$C$16\")*ERFC(0.5*C431*SQRT(INDIRECT($B$1&\"!$F$10\")/(INDIRECT($B$1&\"!$F$9\")*INDIRECT($B$1&\"!$C$20\")*B431))),\"\")","v":""},{"$f":"(INDIRECT($B$1&\"!$F$15\") -D431)/C431","v":{"$error":"#VALUE!"}},{"$f":"IF(ISNUMBER(E431),E431*INDIRECT($B$1&\"!$F$9\")/$G$3,\"\")","v":""},"",{"$f":"IF(B431<INDIRECT($B$1&\"!$C$7\"),H430-G431,\"\")","v":""}]
[null,{"$f":"IF(ISNUMBER(B431),IF(AND(B431<INDIRECT($B$1&\"!$C$7\"),H431>0), B431+0.5,\"\"),\"\")","v":""},"",{"$f":"IF(AND(B432<INDIRECT($B$1&\"!$C$7\"),ISNUMBER(B432)),INDIRECT($B$1&\"!$C$16\")*ERFC(0.5*C432*SQRT(INDIRECT($B$1&\"!$F$10\")/(INDIRECT($B$1&\"!$F$9\")*INDIRECT($B$1&\"!$C$20\")*B432))),\"\")","v":""},{"$f":"(INDIRECT($B$1&\"!$F$15\") -D432)/C432","v":{"$error":"#VALUE!"}},{"$f":"IF(ISNUMBER(E432),E432*INDIRECT($B$1&\"!$F$9\")/$G$3,\"\")","v":""},"",{"$f":"IF(B432<INDIRECT($B$1&\"!$C$7\"),H431-G432,\"\")","v":""}]
[null,{"$f":"IF(ISNUMBER(B432),IF(AND(B432<INDIRECT($B$1&\"!$C$7\"),H432>0), B432+0.5,\"\"),\"\")","v":""},{"$f":"IF(ISNUMBER(B433),H432,\"\")","v":""},{"$f":"IF(AND(B433<INDIRECT($B$1&\"!$C$7\"),ISNUMBER(B433)),INDIRECT($B$1&\"!$C$16\")*ERFC(0.5*C433*SQRT(INDIRECT($B$1&\"!$F$10\")/(INDIRECT($B$1&\"!$F$9\")*INDIRECT($B$1&\"!$C$20\")*B433))),\"\")","v":""},{"$f":"(INDIRECT($B$1&\"!$F$15\") -D433)/C433","v":{"$error":"#VALUE!"}},{"$f":"IF(ISNUMBER(E433),E433*INDIRECT($B$1&\"!$F$9\")/$G$3,\"\")","v":""},{"$f":"IF(ISNUMBER(F433),F433*ABS(B432-B433)/$I$3,\"\")","v":""},{"$f":"IF(B433<INDIRECT($B$1&\"!$C$7\"),H432-G433,\"\")","v":""}]
[null,{"$f":"IF(ISNUMBER(B433),IF(AND(B433<INDIRECT($B$1&\"!$C$7\"),H433>0), B433+0.5,\"\"),\"\")","v":""},"",{"$f":"IF(AND(B434<INDIRECT($B$1&\"!$C$7\"),ISNUMBER(B434)),INDIRECT($B$1&\"!$C$16\")*ERFC(0.5*C434*SQRT(INDIRECT($B$1&\"!$F$10\")/(INDIRECT($B$1&\"!$F$9\")*INDIRECT($B$1&\"!$C$20\")*B434))),\"\")","v":""},{"$f":"(INDIRECT($B$1&\"!$F$15\") -D434)/C434","v":{"$error":"#VALUE!"}},{"$f":"IF(ISNUMBER(E434),E434*INDIRECT($B$1&\"!$F$9\")/$G$3,\"\")","v":""},"",{"$f":"IF(B434<INDIRECT($B$1&\"!$C$7\"),H433-G434,\"\")","v":""}]
[null,{"$f":"IF(ISNUMBER(B434),IF(AND(B434<INDIRECT($B$1&\"!$C$7\"),H434>0), B434+0.5,\"\"),\"\")","v":""},"",{"$f":"IF(AND(B435<INDIRECT($B$1&\"!$C$7\"),ISNUMBER(B435)),INDIRECT($B$1&\"!$C$16\")*ERFC(0.5*C435*SQRT(INDIRECT($B$1&\"!$F$10\")/(INDIRECT($B$1&\"!$F$9\")*INDIRECT($B$1&\"!$C$20\")*B435))),\"\")","v":""},{"$f":"(INDIRECT($B$1&\"!$F$15\") -D435)/C435","v":{"$error":"#VALUE!"}},{"$f":"IF(ISNUMBER(E435),E435*INDIRECT($B$1&\"!$F$9\")/$G$3,\"\")","v":""},"",{"$f":"IF(B435<INDIRECT($B$1&\"!$C$7\"),H434-G435,\"\")","v":""}]
[null,{"$f":"IF(ISNUMBER(B435),IF(AND(B435<INDIRECT($B$1&\"!$C$7\"),H435>0), B435+0.5,\"\"),\"\")","v":""},"",{"$f":"IF(AND(B436<INDIRECT($B$1&\"!$C$7\"),ISNUMBER(B436)),INDIRECT($B$1&\"!$C$16\")*ERFC(0.5*C436*SQRT(INDIRECT($B$1&\"!$F$10\")/(INDIRECT($B$1&\"!$F$9\")*INDIRECT($B$1&\"!$C$20\")*B436))),\"\")","v":""},{"$f":"(INDIRECT($B$1&\"!$F$15\") -D436)/C436","v":{"$error":"#VALUE!"}},{"$f":"IF(ISNUMBER(E436),E436*INDIRECT($B$1&\"!$F$9\")/$G$3,\"\")","v":""},"",{"$f":"IF(B436<INDIRECT($B$1&\"!$C$7\"),H435-G436,\"\")","v":""}]
[null,{"$f":"IF(ISNUMBER(B436),IF(AND(B436<INDIRECT($B$1&\"!$C$7\"),H436>0), B436+0.5,\"\"),\"\")","v":""},"",{"$f":"IF(AND(B437<INDIRECT($B$1&\"!$C$7\"),ISNUMBER(B437)),INDIRECT($B$1&\"!$C$16\")*ERFC(0.5*C437*SQRT(INDIRECT($B$1&\"!$F$10\")/(INDIRECT($B$1&\"!$F$9\")*INDIRECT($B$1&\"!$C$20\")*B437))),\"\")","v":""},{"$f":"(INDIRECT($B$1&\"!$F$15\") -D437)/C437","v":{"$error":"#VALUE!"}},{"$f":"IF(ISNUMBER(E437),E437*INDIRECT($B$1&\"!$F$9\")/$G$3,\"\")","v":""},"",{"$f":"IF(B437<INDIRECT($B$1&\"!$C$7\"),H436-G437,\"\")","v":""}]
[null,{"$f":"IF(ISNUMBER(B437),IF(AND(B437<INDIRECT($B$1&\"!$C$7\"),H437>0), B437+0.5,\"\"),\"\")","v":""},"",{"$f":"IF(AND(B438<INDIRECT($B$1&\"!$C$7\"),ISNUMBER(B438)),INDIRECT($B$1&\"!$C$16\")*ERFC(0.5*C438*SQRT(INDIRECT($B$1&\"!$F$10\")/(INDIRECT($B$1&\"!$F$9\")*INDIRECT($B$1&\"!$C$20\")*B438))),\"\")","v":""},{"$f":"(INDIRECT($B$1&\"!$F$15\") -D438)/C438","v":{"$error":"#VALUE!"}},{"$f":"IF(ISNUMBER(E438),E438*INDIRECT($B$1&\"!$F$9\")/$G$3,\"\")","v":""},"",{"$f":"IF(B438<INDIRECT($B$1&\"!$C$7\"),H437-G438,\"\")","v":""}]
[null,{"$f":"IF(ISNUMBER(B438),IF(AND(B438<INDIRECT($B$1&\"!$C$7\"),H438>0), B438+0.5,\"\"),\"\")","v":""},"",{"$f":"IF(AND(B439<INDIRECT($B$1&\"!$C$7\"),ISNUMBER(B439)),INDIRECT($B$1&\"!$C$16\")*ERFC(0.5*C439*SQRT(INDIRECT($B$1&\"!$F$10\")/(INDIRECT($B$1&\"!$F$9\")*INDIRECT($B$1&\"!$C$20\")*B439))),\"\")","v":""},{"$f":"(INDIRECT($B$1&\"!$F$15\") -D439)/C439","v":{"$error":"#VALUE!"}},{"$f":"IF(ISNUMBER(E439),E439*INDIRECT($B$1&\"!$F$9\")/$G$3,\"\")","v":""},"",{"$f":"IF(B439<INDIRECT($B$1&\"!$C$7\"),H438-G439,\"\")","v":""}]
[null,{"$f":"IF(ISNUMBER(B439),IF(AND(B439<INDIRECT($B$1&\"!$C$7\"),H439>0), B439+0.5,\"\"),\"\")","v":""},"",{"$f":"IF(AND(B440<INDIRECT($B$1&\"!$C$7\"),ISNUMBER(B440)),INDIRECT($B$1&\"!$C$16\")*ERFC(0.5*C440*SQRT(INDIRECT($B$1&\"!$F$10\")/(INDIRECT($B$1&\"!$F$9\")*INDIRECT($B$1&\"!$C$20\")*B440))),\"\")","v":""},{"$f":"(INDIRECT($B$1&\"!$F$15\") -D440)/C440","v":{"$error":"#VALUE!"}},{"$f":"IF(ISNUMBER(E440),E440*INDIRECT($B$1&\"!$F$9\")/$G$3,\"\")","v":""},"",{"$f":"IF(B440<INDIRECT($B$1&\"!$C$7\"),H439-G440,\"\")","v":""}]
[null,{"$f":"IF(ISNUMBER(B440),IF(AND(B440<INDIRECT($B$1&\"!$C$7\"),H440>0), B440+0.5,\"\"),\"\")","v":""},"",{"$f":"IF(AND(B441<INDIRECT($B$1&\"!$C$7\"),ISNUMBER(B441)),INDIRECT($B$1&\"!$C$16\")*ERFC(0.5*C441*SQRT(INDIRECT($B$1&\"!$F$10\")/(INDIRECT($B$1&\"!$F$9\")*INDIRECT($B$1&\"!$C$20\")*B441))),\"\")","v":""},{"$f":"(INDIRECT($B$1&\"!$F$15\") -D441)/C441","v":{"$error":"#VALUE!"}},{"$f":"IF(ISNUMBER(E441),E441*INDIRECT($B$1&\"!$F$9\")/$G$3,\"\")","v":""},"",{"$f":"IF(B441<INDIRECT($B$1&\"!$C$7\"),H440-G441,\"\")","v":""}]
[null,{"$f":"IF(ISNUMBER(B441),IF(AND(B441<INDIRECT($B$1&\"!$C$7\"),H441>0), B441+0.5,\"\"),\"\")","v":""},"",{"$f":"IF(AND(B442<INDIRECT($B$1&\"!$C$7\"),ISNUMBER(B442)),INDIRECT($B$1&\"!$C$16\")*ERFC(0.5*C442*SQRT(INDIRECT($B$1&\"!$F$10\")/(INDIRECT($B$1&\"!$F$9\")*INDIRECT($B$1&\"!$C$20\")*B442))),\"\")","v":""},{"$f":"(INDIRECT($B$1&\"!$F$15\") -D442)/C442","v":{"$error":"#VALUE!"}},{"$f":"IF(ISNUMBER(E442),E442*INDIRECT($B$1&\"!$F$9\")/$G$3,\"\")","v":""},"",{"$f":"IF(B442<INDIRECT($B$1&\"!$C$7\"),H441-G442,\"\")","v":""}]
[null,{"$f":"IF(ISNUMBER(B442),IF(AND(B442<INDIRECT($B$1&\"!$C$7\"),H442>0), B442+0.5,\"\"),\"\")","v":""},"",{"$f":"IF(AND(B443<INDIRECT($B$1&\"!$C$7\"),ISNUMBER(B443)),INDIRECT($B$1&\"!$C$16\")*ERFC(0.5*C443*SQRT(INDIRECT($B$1&\"!$F$10\")/(INDIRECT($B$1&\"!$F$9\")*INDIRECT($B$1&\"!$C$20\")*B443))),\"\")","v":""},{"$f":"(INDIRECT($B$1&\"!$F$15\") -D443)/C443","v":{"$error":"#VALUE!"}},{"$f":"IF(ISNUMBER(E443),E443*INDIRECT($B$1&\"!$F$9\")/$G$3,\"\")","v":""},"",{"$f":"IF(B443<INDIRECT($B$1&\"!$C$7\"),H442-G443,\"\")","v":""}]
[null,{"$f":"IF(ISNUMBER(B443),IF(AND(B443<INDIRECT($B$1&\"!$C$7\"),H443>0), B443+0.5,\"\"),\"\")","v":""},"",{"$f":"IF(AND(B444<INDIRECT($B$1&\"!$C$7\"),ISNUMBER(B444)),INDIRECT($B$1&\"!$C$16\")*ERFC(0.5*C444*SQRT(INDIRECT($B$1&\"!$F$10\")/(INDIRECT($B$1&\"!$F$9\")*INDIRECT($B$1&\"!$C$20\")*B444))),\"\")","v":""},{"$f":"(INDIRECT($B$1&\"!$F$15\") -D444)/C444","v":{"$error":"#VALUE!"}},{"$f":"IF(ISNUMBER(E444),E444*INDIRECT($B$1&\"!$F$9\")/$G$3,\"\")","v":""},"",{"$f":"IF(B444<INDIRECT($B$1&\"!$C$7\"),H443-G444,\"\")","v":""}]
[null,{"$f":"IF(ISNUMBER(B444),IF(AND(B444<INDIRECT($B$1&\"!$C$7\"),H444>0), B444+0.5,\"\"),\"\")","v":""},"",{"$f":"IF(AND(B445<INDIRECT($B$1&\"!$C$7\"),ISNUMBER(B445)),INDIRECT($B$1&\"!$C$16\")*ERFC(0.5*C445*SQRT(INDIRECT($B$1&\"!$F$10\")/(INDIRECT($B$1&\"!$F$9\")*INDIRECT($B$1&\"!$C$20\")*B445))),\"\")","v":""},{"$f":"(INDIRECT($B$1&\"!$F$15\") -D445)/C445","v":{"$error":"#VALUE!"}},{"$f":"IF(ISNUMBER(E445),E445*INDIRECT($B$1&\"!$F$9\")/$G$3,\"\")","v":""},"",{"$f":"IF(B445<INDIRECT($B$1&\"!$C$7\"),H444-G445,\"\")","v":""}]
[null,{"$f":"IF(ISNUMBER(B445),IF(AND(B445<INDIRECT($B$1&\"!$C$7\"),H445>0), B445+0.5,\"\"),\"\")","v":""},"",{"$f":"IF(AND(B446<INDIRECT($B$1&\"!$C$7\"),ISNUMBER(B446)),INDIRECT($B$1&\"!$C$16\")*ERFC(0.5*C446*SQRT(INDIRECT($B$1&\"!$F$10\")/(INDIRECT($B$1&\"!$F$9\")*INDIRECT($B$1&\"!$C$20\")*B446))),\"\")","v":""},{"$f":"(INDIRECT($B$1&\"!$F$15\") -D446)/C446","v":{"$error":"#VALUE!"}},{"$f":"IF(ISNUMBER(E446),E446*INDIRECT($B$1&\"!$F$9\")/$G$3,\"\")","v":""},"",{"$f":"IF(B446<INDIRECT($B$1&\"!$C$7\"),H445-G446,\"\")","v":""}]
[null,{"$f":"IF(ISNUMBER(B446),IF(AND(B446<INDIRECT($B$1&\"!$C$7\"),H446>0), B446+0.5,\"\"),\"\")","v":""},"",{"$f":"IF(AND(B447<INDIRECT($B$1&\"!$C$7\"),ISNUMBER(B447)),INDIRECT($B$1&\"!$C$16\")*ERFC(0.5*C447*SQRT(INDIRECT($B$1&\"!$F$10\")/(INDIRECT($B$1&\"!$F$9\")*INDIRECT($B$1&\"!$C$20\")*B447))),\"\")","v":""},{"$f":"(INDIRECT($B$1&\"!$F$15\") -D447)/C447","v":{"$error":"#VALUE!"}},{"$f":"IF(ISNUMBER(E447),E447*INDIRECT($B$1&\"!$F$9\")/$G$3,\"\")","v":""},"",{"$f":"IF(B447<INDIRECT($B$1&\"!$C$7\"),H446-G447,\"\")","v":""}]
[null,{"$f":"IF(ISNUMBER(B447),IF(AND(B447<INDIRECT($B$1&\"!$C$7\"),H447>0), B447+0.5,\"\"),\"\")","v":""},"",{"$f":"IF(AND(B448<INDIRECT($B$1&\"!$C$7\"),ISNUMBER(B448)),INDIRECT($B$1&\"!$C$16\")*ERFC(0.5*C448*SQRT(INDIRECT($B$1&\"!$F$10\")/(INDIRECT($B$1&\"!$F$9\")*INDIRECT($B$1&\"!$C$20\")*B448))),\"\")","v":""},{"$f":"(INDIRECT($B$1&\"!$F$15\") -D448)/C448","v":{"$error":"#VALUE!"}},{"$f":"IF(ISNUMBER(E448),E448*INDIRECT($B$1&\"!$F$9\")/$G$3,\"\")","v":""},"",{"$f":"IF(B448<INDIRECT($B$1&\"!$C$7\"),H447-G448,\"\")","v":""}]
[null,{"$f":"IF(ISNUMBER(B448),IF(AND(B448<INDIRECT($B$1&\"!$C$7\"),H448>0), B448+0.5,\"\"),\"\")","v":""},"",{"$f":"IF(AND(B449<INDIRECT($B$1&\"!$C$7\"),ISNUMBER(B449)),INDIRECT($B$1&\"!$C$16\")*ERFC(0.5*C449*SQRT(INDIRECT($B$1&\"!$F$10\")/(INDIRECT($B$1&\"!$F$9\")*INDIRECT($B$1&\"!$C$20\")*B449))),\"\")","v":""},{"$f":"(INDIRECT($B$1&\"!$F$15\") -D449)/C449","v":{"$error":"#VALUE!"}},{"$f":"IF(ISNUMBER(E449),E449*INDIRECT($B$1&\"!$F$9\")/$G$3,\"\")","v":""},"",{"$f":"IF(B449<INDIRECT($B$1&\"!$C$7\"),H448-G449,\"\")","v":""}]
[null,{"$f":"IF(ISNUMBER(B449),IF(AND(B449<INDIRECT($B$1&\"!$C$7\"),H449>0), B449+0.5,\"\"),\"\")","v":""},"",{"$f":"IF(AND(B450<INDIRECT($B$1&\"!$C$7\"),ISNUMBER(B450)),INDIRECT($B$1&\"!$C$16\")*ERFC(0.5*C450*SQRT(INDIRECT($B$1&\"!$F$10\")/(INDIRECT($B$1&\"!$F$9\")*INDIRECT($B$1&\"!$C$20\")*B450))),\"\")","v":""},{"$f":"(INDIRECT($B$1&\"!$F$15\") -D450)/C450","v":{"$error":"#VALUE!"}},{"$f":"IF(ISNUMBER(E450),E450*INDIRECT($B$1&\"!$F$9\")/$G$3,\"\")","v":""},"",{"$f":"IF(B450<INDIRECT($B$1&\"!$C$7\"),H449-G450,\"\")","v":""}]
[null,{"$f":"IF(ISNUMBER(B450),IF(AND(B450<INDIRECT($B$1&\"!$C$7\"),H450>0), B450+0.5,\"\"),\"\")","v":""},"",{"$f":"IF(AND(B451<INDIRECT($B$1&\"!$C$7\"),ISNUMBER(B451)),INDIRECT($B$1&\"!$C$16\")*ERFC(0.5*C451*SQRT(INDIRECT($B$1&\"!$F$10\")/(INDIRECT($B$1&\"!$F$9\")*INDIRECT($B$1&\"!$C$20\")*B451))),\"\")","v":""},{"$f":"(INDIRECT($B$1&\"!$F$15\") -D451)/C451","v":{"$error":"#VALUE!"}},{"$f":"IF(ISNUMBER(E451),E451*INDIRECT($B$1&\"!$F$9\")/$G$3,\"\")","v":""},"",{"$f":"IF(B451<INDIRECT($B$1&\"!$C$7\"),H450-G451,\"\")","v":""}]
[null,{"$f":"IF(ISNUMBER(B451),IF(AND(B451<INDIRECT($B$1&\"!$C$7\"),H451>0), B451+0.5,\"\"),\"\")","v":""},"",{"$f":"IF(AND(B452<INDIRECT($B$1&\"!$C$7\"),ISNUMBER(B452)),INDIRECT($B$1&\"!$C$16\")*ERFC(0.5*C452*SQRT(INDIRECT($B$1&\"!$F$10\")/(INDIRECT($B$1&\"!$F$9\")*INDIRECT($B$1&\"!$C$20\")*B452))),\"\")","v":""},{"$f":"(INDIRECT($B$1&\"!$F$15\") -D452)/C452","v":{"$error":"#VALUE!"}},{"$f":"IF(ISNUMBER(E452),E452*INDIRECT($B$1&\"!$F$9\")/$G$3,\"\")","v":""},"",{"$f":"IF(B452<INDIRECT($B$1&\"!$C$7\"),H451-G452,\"\")","v":""}]
[null,{"$f":"IF(ISNUMBER(B452),IF(AND(B452<INDIRECT($B$1&\"!$C$7\"),H452>0), B452+0.5,\"\"),\"\")","v":""},"",{"$f":"IF(AND(B453<INDIRECT($B$1&\"!$C$7\"),ISNUMBER(B453)),INDIRECT($B$1&\"!$C$16\")*ERFC(0.5*C453*SQRT(INDIRECT($B$1&\"!$F$10\")/(INDIRECT($B$1&\"!$F$9\")*INDIRECT($B$1&\"!$C$20\")*B453))),\"\")","v":""},{"$f":"(INDIRECT($B$1&\"!$F$15\") -D453)/C453","v":{"$error":"#VALUE!"}},{"$f":"IF(ISNUMBER(E453),E453*INDIRECT($B$1&\"!$F$9\")/$G$3,\"\")","v":""},"",{"$f":"IF(B453<INDIRECT($B$1&\"!$C$7\"),H452-G453,\"\")","v":""}]
[null,{"$f":"IF(ISNUMBER(B453),IF(AND(B453<INDIRECT($B$1&\"!$C$7\"),H453>0), B453+0.5,\"\"),\"\")","v":""},"",{"$f":"IF(AND(B454<INDIRECT($B$1&\"!$C$7\"),ISNUMBER(B454)),INDIRECT($B$1&\"!$C$16\")*ERFC(0.5*C454*SQRT(INDIRECT($B$1&\"!$F$10\")/(INDIRECT($B$1&\"!$F$9\")*INDIRECT($B$1&\"!$C$20\")*B454))),\"\")","v":""},{"$f":"(INDIRECT($B$1&\"!$F$15\") -D454)/C454","v":{"$error":"#VALUE!"}},{"$f":"IF(ISNUMBER(E454),E454*INDIRECT($B$1&\"!$F$9\")/$G$3,\"\")","v":""},"",{"$f":"IF(B454<INDIRECT($B$1&\"!$C$7\"),H453-G454,\"\")","v":""}]
[null,{"$f":"IF(ISNUMBER(B454),IF(AND(B454<INDIRECT($B$1&\"!$C$7\"),H454>0), B454+0.5,\"\"),\"\")","v":""},"",{"$f":"IF(AND(B455<INDIRECT($B$1&\"!$C$7\"),ISNUMBER(B455)),INDIRECT($B$1&\"!$C$16\")*ERFC(0.5*C455*SQRT(INDIRECT($B$1&\"!$F$10\")/(INDIRECT($B$1&\"!$F$9\")*INDIRECT($B$1&\"!$C$20\")*B455))),\"\")","v":""},{"$f":"(INDIRECT($B$1&\"!$F$15\") -D455)/C455","v":{"$error":"#VALUE!"}},{"$f":"IF(ISNUMBER(E455),E455*INDIRECT($B$1&\"!$F$9\")/$G$3,\"\")","v":""},"",{"$f":"IF(B455<INDIRECT($B$1&\"!$C$7\"),H454-G455,\"\")","v":""}]
[null,{"$f":"IF(ISNUMBER(B455),IF(AND(B455<INDIRECT($B$1&\"!$C$7\"),H455>0), B455+0.5,\"\"),\"\")","v":""},"",{"$f":"IF(AND(B456<INDIRECT($B$1&\"!$C$7\"),ISNUMBER(B456)),INDIRECT($B$1&\"!$C$16\")*ERFC(0.5*C456*SQRT(INDIRECT($B$1&\"!$F$10\")/(INDIRECT($B$1&\"!$F$9\")*INDIRECT($B$1&\"!$C$20\")*B456))),\"\")","v":""},{"$f":"(INDIRECT($B$1&\"!$F$15\") -D456)/C456","v":{"$error":"#VALUE!"}},{"$f":"IF(ISNUMBER(E456),E456*INDIRECT($B$1&\"!$F$9\")/$G$3,\"\")","v":""},"",{"$f":"IF(B456<INDIRECT($B$1&\"!$C$7\"),H455-G456,\"\")","v":""}]
[null,{"$f":"IF(ISNUMBER(B456),IF(AND(B456<INDIRECT($B$1&\"!$C$7\"),H456>0), B456+0.5,\"\"),\"\")","v":""},"",{"$f":"IF(AND(B457<INDIRECT($B$1&\"!$C$7\"),ISNUMBER(B457)),INDIRECT($B$1&\"!$C$16\")*ERFC(0.5*C457*SQRT(INDIRECT($B$1&\"!$F$10\")/(INDIRECT($B$1&\"!$F$9\")*INDIRECT($B$1&\"!$C$20\")*B457))),\"\")","v":""},{"$f":"(INDIRECT($B$1&\"!$F$15\") -D457)/C457","v":{"$error":"#VALUE!"}},{"$f":"IF(ISNUMBER(E457),E457*INDIRECT($B$1&\"!$F$9\")/$G$3,\"\")","v":""},"",{"$f":"IF(B457<INDIRECT($B$1&\"!$C$7\"),H456-G457,\"\")","v":""}]
[null,{"$f":"IF(ISNUMBER(B457),IF(AND(B457<INDIRECT($B$1&\"!$C$7\"),H457>0), B457+0.5,\"\"),\"\")","v":""},"",{"$f":"IF(AND(B458<INDIRECT($B$1&\"!$C$7\"),ISNUMBER(B458)),INDIRECT($B$1&\"!$C$16\")*ERFC(0.5*C458*SQRT(INDIRECT($B$1&\"!$F$10\")/(INDIRECT($B$1&\"!$F$9\")*INDIRECT($B$1&\"!$C$20\")*B458))),\"\")","v":""},{"$f":"(INDIRECT($B$1&\"!$F$15\") -D458)/C458","v":{"$error":"#VALUE!"}},{"$f":"IF(ISNUMBER(E458),E458*INDIRECT($B$1&\"!$F$9\")/$G$3,\"\")","v":""},"",{"$f":"IF(B458<INDIRECT($B$1&\"!$C$7\"),H457-G458,\"\")","v":""}]
[null,{"$f":"IF(ISNUMBER(B458),IF(AND(B458<INDIRECT($B$1&\"!$C$7\"),H458>0), B458+0.5,\"\"),\"\")","v":""},"",{"$f":"IF(AND(B459<INDIRECT($B$1&\"!$C$7\"),ISNUMBER(B459)),INDIRECT($B$1&\"!$C$16\")*ERFC(0.5*C459*SQRT(INDIRECT($B$1&\"!$F$10\")/(INDIRECT($B$1&\"!$F$9\")*INDIRECT($B$1&\"!$C$20\")*B459))),\"\")","v":""},{"$f":"(INDIRECT($B$1&\"!$F$15\") -D459)/C459","v":{"$error":"#VALUE!"}},{"$f":"IF(ISNUMBER(E459),E459*INDIRECT($B$1&\"!$F$9\")/$G$3,\"\")","v":""},"",{"$f":"IF(B459<INDIRECT($B$1&\"!$C$7\"),H458-G459,\"\")","v":""}]
[null,{"$f":"IF(ISNUMBER(B459),IF(AND(B459<INDIRECT($B$1&\"!$C$7\"),H459>0), B459+0.5,\"\"),\"\")","v":""},"",{"$f":"IF(AND(B460<INDIRECT($B$1&\"!$C$7\"),ISNUMBER(B460)),INDIRECT($B$1&\"!$C$16\")*ERFC(0.5*C460*SQRT(INDIRECT($B$1&\"!$F$10\")/(INDIRECT($B$1&\"!$F$9\")*INDIRECT($B$1&\"!$C$20\")*B460))),\"\")","v":""},{"$f":"(INDIRECT($B$1&\"!$F$15\") -D460)/C460","v":{"$error":"#VALUE!"}},{"$f":"IF(ISNUMBER(E460),E460*INDIRECT($B$1&\"!$F$9\")/$G$3,\"\")","v":""},"",{"$f":"IF(B460<INDIRECT($B$1&\"!$C$7\"),H459-G460,\"\")","v":""}]
[null,{"$f":"IF(ISNUMBER(B460),IF(AND(B460<INDIRECT($B$1&\"!$C$7\"),H460>0), B460+0.5,\"\"),\"\")","v":""},"",{"$f":"IF(AND(B461<INDIRECT($B$1&\"!$C$7\"),ISNUMBER(B461)),INDIRECT($B$1&\"!$C$16\")*ERFC(0.5*C461*SQRT(INDIRECT($B$1&\"!$F$10\")/(INDIRECT($B$1&\"!$F$9\")*INDIRECT($B$1&\"!$C$20\")*B461))),\"\")","v":""},{"$f":"(INDIRECT($B$1&\"!$F$15\") -D461)/C461","v":{"$error":"#VALUE!"}},{"$f":"IF(ISNUMBER(E461),E461*INDIRECT($B$1&\"!$F$9\")/$G$3,\"\")","v":""},"",{"$f":"IF(B461<INDIRECT($B$1&\"!$C$7\"),H460-G461,\"\")","v":""}]
[null,{"$f":"IF(ISNUMBER(B461),IF(AND(B461<INDIRECT($B$1&\"!$C$7\"),H461>0), B461+0.5,\"\"),\"\")","v":""},"",{"$f":"IF(AND(B462<INDIRECT($B$1&\"!$C$7\"),ISNUMBER(B462)),INDIRECT($B$1&\"!$C$16\")*ERFC(0.5*C462*SQRT(INDIRECT($B$1&\"!$F$10\")/(INDIRECT($B$1&\"!$F$9\")*INDIRECT($B$1&\"!$C$20\")*B462))),\"\")","v":""},{"$f":"(INDIRECT($B$1&\"!$F$15\") -D462)/C462","v":{"$error":"#VALUE!"}},{"$f":"IF(ISNUMBER(E462),E462*INDIRECT($B$1&\"!$F$9\")/$G$3,\"\")","v":""},"",{"$f":"IF(B462<INDIRECT($B$1&\"!$C$7\"),H461-G462,\"\")","v":""}]
[null,{"$f":"IF(ISNUMBER(B462),IF(AND(B462<INDIRECT($B$1&\"!$C$7\"),H462>0), B462+0.5,\"\"),\"\")","v":""},"",{"$f":"IF(AND(B463<INDIRECT($B$1&\"!$C$7\"),ISNUMBER(B463)),INDIRECT($B$1&\"!$C$16\")*ERFC(0.5*C463*SQRT(INDIRECT($B$1&\"!$F$10\")/(INDIRECT($B$1&\"!$F$9\")*INDIRECT($B$1&\"!$C$20\")*B463))),\"\")","v":""},{"$f":"(INDIRECT($B$1&\"!$F$15\") -D463)/C463","v":{"$error":"#VALUE!"}},{"$f":"IF(ISNUMBER(E463),E463*INDIRECT($B$1&\"!$F$9\")/$G$3,\"\")","v":""},"",{"$f":"IF(B463<INDIRECT($B$1&\"!$C$7\"),H462-G463,\"\")","v":""}]
[null,{"$f":"IF(ISNUMBER(B463),IF(AND(B463<INDIRECT($B$1&\"!$C$7\"),H463>0), B463+0.5,\"\"),\"\")","v":""},"",{"$f":"IF(AND(B464<INDIRECT($B$1&\"!$C$7\"),ISNUMBER(B464)),INDIRECT($B$1&\"!$C$16\")*ERFC(0.5*C464*SQRT(INDIRECT($B$1&\"!$F$10\")/(INDIRECT($B$1&\"!$F$9\")*INDIRECT($B$1&\"!$C$20\")*B464))),\"\")","v":""},{"$f":"(INDIRECT($B$1&\"!$F$15\") -D464)/C464","v":{"$error":"#VALUE!"}},{"$f":"IF(ISNUMBER(E464),E464*INDIRECT($B$1&\"!$F$9\")/$G$3,\"\")","v":""},"",{"$f":"IF(B464<INDIRECT($B$1&\"!$C$7\"),H463-G464,\"\")","v":""}]
[null,{"$f":"IF(ISNUMBER(B464),IF(AND(B464<INDIRECT($B$1&\"!$C$7\"),H464>0), B464+0.5,\"\"),\"\")","v":""},"",{"$f":"IF(AND(B465<INDIRECT($B$1&\"!$C$7\"),ISNUMBER(B465)),INDIRECT($B$1&\"!$C$16\")*ERFC(0.5*C465*SQRT(INDIRECT($B$1&\"!$F$10\")/(INDIRECT($B$1&\"!$F$9\")*INDIRECT($B$1&\"!$C$20\")*B465))),\"\")","v":""},{"$f":"(INDIRECT($B$1&\"!$F$15\") -D465)/C465","v":{"$error":"#VALUE!"}},{"$f":"IF(ISNUMBER(E465),E465*INDIRECT($B$1&\"!$F$9\")/$G$3,\"\")","v":""},"",{"$f":"IF(B465<INDIRECT($B$1&\"!$C$7\"),H464-G465,\"\")","v":""}]
[null,{"$f":"IF(ISNUMBER(B465),IF(AND(B465<INDIRECT($B$1&\"!$C$7\"),H465>0), B465+0.5,\"\"),\"\")","v":""},"",{"$f":"IF(AND(B466<INDIRECT($B$1&\"!$C$7\"),ISNUMBER(B466)),INDIRECT($B$1&\"!$C$16\")*ERFC(0.5*C466*SQRT(INDIRECT($B$1&\"!$F$10\")/(INDIRECT($B$1&\"!$F$9\")*INDIRECT($B$1&\"!$C$20\")*B466))),\"\")","v":""},{"$f":"(INDIRECT($B$1&\"!$F$15\") -D466)/C466","v":{"$error":"#VALUE!"}},{"$f":"IF(ISNUMBER(E466),E466*INDIRECT($B$1&\"!$F$9\")/$G$3,\"\")","v":""},"",{"$f":"IF(B466<INDIRECT($B$1&\"!$C$7\"),H465-G466,\"\")","v":""}]
[null,{"$f":"IF(ISNUMBER(B466),IF(AND(B466<INDIRECT($B$1&\"!$C$7\"),H466>0), B466+0.5,\"\"),\"\")","v":""},"",{"$f":"IF(AND(B467<INDIRECT($B$1&\"!$C$7\"),ISNUMBER(B467)),INDIRECT($B$1&\"!$C$16\")*ERFC(0.5*C467*SQRT(INDIRECT($B$1&\"!$F$10\")/(INDIRECT($B$1&\"!$F$9\")*INDIRECT($B$1&\"!$C$20\")*B467))),\"\")","v":""},{"$f":"(INDIRECT($B$1&\"!$F$15\") -D467)/C467","v":{"$error":"#VALUE!"}},{"$f":"IF(ISNUMBER(E467),E467*INDIRECT($B$1&\"!$F$9\")/$G$3,\"\")","v":""},"",{"$f":"IF(B467<INDIRECT($B$1&\"!$C$7\"),H466-G467,\"\")","v":""}]
[null,{"$f":"IF(ISNUMBER(B467),IF(AND(B467<INDIRECT($B$1&\"!$C$7\"),H467>0), B467+0.5,\"\"),\"\")","v":""},"",{"$f":"IF(AND(B468<INDIRECT($B$1&\"!$C$7\"),ISNUMBER(B468)),INDIRECT($B$1&\"!$C$16\")*ERFC(0.5*C468*SQRT(INDIRECT($B$1&\"!$F$10\")/(INDIRECT($B$1&\"!$F$9\")*INDIRECT($B$1&\"!$C$20\")*B468))),\"\")","v":""},{"$f":"(INDIRECT($B$1&\"!$F$15\") -D468)/C468","v":{"$error":"#VALUE!"}},{"$f":"IF(ISNUMBER(E468),E468*INDIRECT($B$1&\"!$F$9\")/$G$3,\"\")","v":""},"",{"$f":"IF(B468<INDIRECT($B$1&\"!$C$7\"),H467-G468,\"\")","v":""}]
[null,{"$f":"IF(ISNUMBER(B468),IF(AND(B468<INDIRECT($B$1&\"!$C$7\"),H468>0), B468+0.5,\"\"),\"\")","v":""},"",{"$f":"IF(AND(B469<INDIRECT($B$1&\"!$C$7\"),ISNUMBER(B469)),INDIRECT($B$1&\"!$C$16\")*ERFC(0.5*C469*SQRT(INDIRECT($B$1&\"!$F$10\")/(INDIRECT($B$1&\"!$F$9\")*INDIRECT($B$1&\"!$C$20\")*B469))),\"\")","v":""},{"$f":"(INDIRECT($B$1&\"!$F$15\") -D469)/C469","v":{"$error":"#VALUE!"}},{"$f":"IF(ISNUMBER(E469),E469*INDIRECT($B$1&\"!$F$9\")/$G$3,\"\")","v":""},"",{"$f":"IF(B469<INDIRECT($B$1&\"!$C$7\"),H468-G469,\"\")","v":""}]
[null,{"$f":"IF(ISNUMBER(B469),IF(AND(B469<INDIRECT($B$1&\"!$C$7\"),H469>0), B469+0.5,\"\"),\"\")","v":""},"",{"$f":"IF(AND(B470<INDIRECT($B$1&\"!$C$7\"),ISNUMBER(B470)),INDIRECT($B$1&\"!$C$16\")*ERFC(0.5*C470*SQRT(INDIRECT($B$1&\"!$F$10\")/(INDIRECT($B$1&\"!$F$9\")*INDIRECT($B$1&\"!$C$20\")*B470))),\"\")","v":""},{"$f":"(INDIRECT($B$1&\"!$F$15\") -D470)/C470","v":{"$error":"#VALUE!"}},{"$f":"IF(ISNUMBER(E470),E470*INDIRECT($B$1&\"!$F$9\")/$G$3,\"\")","v":""},"",{"$f":"IF(B470<INDIRECT($B$1&\"!$C$7\"),H469-G470,\"\")","v":""}]
[null,{"$f":"IF(ISNUMBER(B470),IF(AND(B470<INDIRECT($B$1&\"!$C$7\"),H470>0), B470+0.5,\"\"),\"\")","v":""},"",{"$f":"IF(AND(B471<INDIRECT($B$1&\"!$C$7\"),ISNUMBER(B471)),INDIRECT($B$1&\"!$C$16\")*ERFC(0.5*C471*SQRT(INDIRECT($B$1&\"!$F$10\")/(INDIRECT($B$1&\"!$F$9\")*INDIRECT($B$1&\"!$C$20\")*B471))),\"\")","v":""},{"$f":"(INDIRECT($B$1&\"!$F$15\") -D471)/C471","v":{"$error":"#VALUE!"}},{"$f":"IF(ISNUMBER(E471),E471*INDIRECT($B$1&\"!$F$9\")/$G$3,\"\")","v":""},"",{"$f":"IF(B471<INDIRECT($B$1&\"!$C$7\"),H470-G471,\"\")","v":""}]
[null,{"$f":"IF(ISNUMBER(B471),IF(AND(B471<INDIRECT($B$1&\"!$C$7\"),H471>0), B471+0.5,\"\"),\"\")","v":""},"",{"$f":"IF(AND(B472<INDIRECT($B$1&\"!$C$7\"),ISNUMBER(B472)),INDIRECT($B$1&\"!$C$16\")*ERFC(0.5*C472*SQRT(INDIRECT($B$1&\"!$F$10\")/(INDIRECT($B$1&\"!$F$9\")*INDIRECT($B$1&\"!$C$20\")*B472))),\"\")","v":""},{"$f":"(INDIRECT($B$1&\"!$F$15\") -D472)/C472","v":{"$error":"#VALUE!"}},{"$f":"IF(ISNUMBER(E472),E472*INDIRECT($B$1&\"!$F$9\")/$G$3,\"\")","v":""},"",{"$f":"IF(B472<INDIRECT($B$1&\"!$C$7\"),H471-G472,\"\")","v":""}]
[null,{"$f":"IF(ISNUMBER(B472),IF(AND(B472<INDIRECT($B$1&\"!$C$7\"),H472>0), B472+0.5,\"\"),\"\")","v":""},"",{"$f":"IF(AND(B473<INDIRECT($B$1&\"!$C$7\"),ISNUMBER(B473)),INDIRECT($B$1&\"!$C$16\")*ERFC(0.5*C473*SQRT(INDIRECT($B$1&\"!$F$10\")/(INDIRECT($B$1&\"!$F$9\")*INDIRECT($B$1&\"!$C$20\")*B473))),\"\")","v":""},{"$f":"(INDIRECT($B$1&\"!$F$15\") -D473)/C473","v":{"$error":"#VALUE!"}},{"$f":"IF(ISNUMBER(E473),E473*INDIRECT($B$1&\"!$F$9\")/$G$3,\"\")","v":""},"",{"$f":"IF(B473<INDIRECT($B$1&\"!$C$7\"),H472-G473,\"\")","v":""}]
[null,{"$f":"IF(ISNUMBER(B473),IF(AND(B473<INDIRECT($B$1&\"!$C$7\"),H473>0), B473+0.5,\"\"),\"\")","v":""},"",{"$f":"IF(AND(B474<INDIRECT($B$1&\"!$C$7\"),ISNUMBER(B474)),INDIRECT($B$1&\"!$C$16\")*ERFC(0.5*C474*SQRT(INDIRECT($B$1&\"!$F$10\")/(INDIRECT($B$1&\"!$F$9\")*INDIRECT($B$1&\"!$C$20\")*B474))),\"\")","v":""},{"$f":"(INDIRECT($B$1&\"!$F$15\") -D474)/C474","v":{"$error":"#VALUE!"}},{"$f":"IF(ISNUMBER(E474),E474*INDIRECT($B$1&\"!$F$9\")/$G$3,\"\")","v":""},"",{"$f":"IF(B474<INDIRECT($B$1&\"!$C$7\"),H473-G474,\"\")","v":""}]
[null,{"$f":"IF(ISNUMBER(B474),IF(AND(B474<INDIRECT($B$1&\"!$C$7\"),H474>0), B474+0.5,\"\"),\"\")","v":""},"",{"$f":"IF(AND(B475<INDIRECT($B$1&\"!$C$7\"),ISNUMBER(B475)),INDIRECT($B$1&\"!$C$16\")*ERFC(0.5*C475*SQRT(INDIRECT($B$1&\"!$F$10\")/(INDIRECT($B$1&\"!$F$9\")*INDIRECT($B$1&\"!$C$20\")*B475))),\"\")","v":""},{"$f":"(INDIRECT($B$1&\"!$F$15\") -D475)/C475","v":{"$error":"#VALUE!"}},{"$f":"IF(ISNUMBER(E475),E475*INDIRECT($B$1&\"!$F$9\")/$G$3,\"\")","v":""},"",{"$f":"IF(B475<INDIRECT($B$1&\"!$C$7\"),H474-G475,\"\")","v":""}]
[null,{"$f":"IF(ISNUMBER(B475),IF(AND(B475<INDIRECT($B$1&\"!$C$7\"),H475>0), B475+0.5,\"\"),\"\")","v":""},"",{"$f":"IF(AND(B476<INDIRECT($B$1&\"!$C$7\"),ISNUMBER(B476)),INDIRECT($B$1&\"!$C$16\")*ERFC(0.5*C476*SQRT(INDIRECT($B$1&\"!$F$10\")/(INDIRECT($B$1&\"!$F$9\")*INDIRECT($B$1&\"!$C$20\")*B476))),\"\")","v":""},{"$f":"(INDIRECT($B$1&\"!$F$15\") -D476)/C476","v":{"$error":"#VALUE!"}},{"$f":"IF(ISNUMBER(E476),E476*INDIRECT($B$1&\"!$F$9\")/$G$3,\"\")","v":""},"",{"$f":"IF(B476<INDIRECT($B$1&\"!$C$7\"),H475-G476,\"\")","v":""}]
[null,{"$f":"IF(ISNUMBER(B476),IF(AND(B476<INDIRECT($B$1&\"!$C$7\"),H476>0), B476+0.5,\"\"),\"\")","v":""},"",{"$f":"IF(AND(B477<INDIRECT($B$1&\"!$C$7\"),ISNUMBER(B477)),INDIRECT($B$1&\"!$C$16\")*ERFC(0.5*C477*SQRT(INDIRECT($B$1&\"!$F$10\")/(INDIRECT($B$1&\"!$F$9\")*INDIRECT($B$1&\"!$C$20\")*B477))),\"\")","v":""},{"$f":"(INDIRECT($B$1&\"!$F$15\") -D477)/C477","v":{"$error":"#VALUE!"}},{"$f":"IF(ISNUMBER(E477),E477*INDIRECT($B$1&\"!$F$9\")/$G$3,\"\")","v":""},"",{"$f":"IF(B477<INDIRECT($B$1&\"!$C$7\"),H476-G477,\"\")","v":""}]
[null,{"$f":"IF(ISNUMBER(B477),IF(AND(B477<INDIRECT($B$1&\"!$C$7\"),H477>0), B477+0.5,\"\"),\"\")","v":""},"",{"$f":"IF(AND(B478<INDIRECT($B$1&\"!$C$7\"),ISNUMBER(B478)),INDIRECT($B$1&\"!$C$16\")*ERFC(0.5*C478*SQRT(INDIRECT($B$1&\"!$F$10\")/(INDIRECT($B$1&\"!$F$9\")*INDIRECT($B$1&\"!$C$20\")*B478))),\"\")","v":""},{"$f":"(INDIRECT($B$1&\"!$F$15\") -D478)/C478","v":{"$error":"#VALUE!"}},{"$f":"IF(ISNUMBER(E478),E478*INDIRECT($B$1&\"!$F$9\")/$G$3,\"\")","v":""},"",{"$f":"IF(B478<INDIRECT($B$1&\"!$C$7\"),H477-G478,\"\")","v":""}]
[null,{"$f":"IF(ISNUMBER(B478),IF(AND(B478<INDIRECT($B$1&\"!$C$7\"),H478>0), B478+0.5,\"\"),\"\")","v":""},"",{"$f":"IF(AND(B479<INDIRECT($B$1&\"!$C$7\"),ISNUMBER(B479)),INDIRECT($B$1&\"!$C$16\")*ERFC(0.5*C479*SQRT(INDIRECT($B$1&\"!$F$10\")/(INDIRECT($B$1&\"!$F$9\")*INDIRECT($B$1&\"!$C$20\")*B479))),\"\")","v":""},{"$f":"(INDIRECT($B$1&\"!$F$15\") -D479)/C479","v":{"$error":"#VALUE!"}},{"$f":"IF(ISNUMBER(E479),E479*INDIRECT($B$1&\"!$F$9\")/$G$3,\"\")","v":""},"",{"$f":"IF(B479<INDIRECT($B$1&\"!$C$7\"),H478-G479,\"\")","v":""}]
[null,{"$f":"IF(ISNUMBER(B479),IF(AND(B479<INDIRECT($B$1&\"!$C$7\"),H479>0), B479+0.5,\"\"),\"\")","v":""},"",{"$f":"IF(AND(B480<INDIRECT($B$1&\"!$C$7\"),ISNUMBER(B480)),INDIRECT($B$1&\"!$C$16\")*ERFC(0.5*C480*SQRT(INDIRECT($B$1&\"!$F$10\")/(INDIRECT($B$1&\"!$F$9\")*INDIRECT($B$1&\"!$C$20\")*B480))),\"\")","v":""},{"$f":"(INDIRECT($B$1&\"!$F$15\") -D480)/C480","v":{"$error":"#VALUE!"}},{"$f":"IF(ISNUMBER(E480),E480*INDIRECT($B$1&\"!$F$9\")/$G$3,\"\")","v":""},"",{"$f":"IF(B480<INDIRECT($B$1&\"!$C$7\"),H479-G480,\"\")","v":""}]
[null,{"$f":"IF(ISNUMBER(B480),IF(AND(B480<INDIRECT($B$1&\"!$C$7\"),H480>0), B480+0.5,\"\"),\"\")","v":""},"",{"$f":"IF(AND(B481<INDIRECT($B$1&\"!$C$7\"),ISNUMBER(B481)),INDIRECT($B$1&\"!$C$16\")*ERFC(0.5*C481*SQRT(INDIRECT($B$1&\"!$F$10\")/(INDIRECT($B$1&\"!$F$9\")*INDIRECT($B$1&\"!$C$20\")*B481))),\"\")","v":""},{"$f":"(INDIRECT($B$1&\"!$F$15\") -D481)/C481","v":{"$error":"#VALUE!"}},{"$f":"IF(ISNUMBER(E481),E481*INDIRECT($B$1&\"!$F$9\")/$G$3,\"\")","v":""},"",{"$f":"IF(B481<INDIRECT($B$1&\"!$C$7\"),H480-G481,\"\")","v":""}]
[null,{"$f":"IF(ISNUMBER(B481),IF(AND(B481<INDIRECT($B$1&\"!$C$7\"),H481>0), B481+0.5,\"\"),\"\")","v":""},"",{"$f":"IF(AND(B482<INDIRECT($B$1&\"!$C$7\"),ISNUMBER(B482)),INDIRECT($B$1&\"!$C$16\")*ERFC(0.5*C482*SQRT(INDIRECT($B$1&\"!$F$10\")/(INDIRECT($B$1&\"!$F$9\")*INDIRECT($B$1&\"!$C$20\")*B482))),\"\")","v":""},{"$f":"(INDIRECT($B$1&\"!$F$15\") -D482)/C482","v":{"$error":"#VALUE!"}},{"$f":"IF(ISNUMBER(E482),E482*INDIRECT($B$1&\"!$F$9\")/$G$3,\"\")","v":""},"",{"$f":"IF(B482<INDIRECT($B$1&\"!$C$7\"),H481-G482,\"\")","v":""}]
[null,{"$f":"IF(ISNUMBER(B482),IF(AND(B482<INDIRECT($B$1&\"!$C$7\"),H482>0), B482+0.5,\"\"),\"\")","v":""},"",{"$f":"IF(AND(B483<INDIRECT($B$1&\"!$C$7\"),ISNUMBER(B483)),INDIRECT($B$1&\"!$C$16\")*ERFC(0.5*C483*SQRT(INDIRECT($B$1&\"!$F$10\")/(INDIRECT($B$1&\"!$F$9\")*INDIRECT($B$1&\"!$C$20\")*B483))),\"\")","v":""},{"$f":"(INDIRECT($B$1&\"!$F$15\") -D483)/C483","v":{"$error":"#VALUE!"}},{"$f":"IF(ISNUMBER(E483),E483*INDIRECT($B$1&\"!$F$9\")/$G$3,\"\")","v":""},"",{"$f":"IF(B483<INDIRECT($B$1&\"!$C$7\"),H482-G483,\"\")","v":""}]
[null,{"$f":"IF(ISNUMBER(B483),IF(AND(B483<INDIRECT($B$1&\"!$C$7\"),H483>0), B483+0.5,\"\"),\"\")","v":""},"",{"$f":"IF(AND(B484<INDIRECT($B$1&\"!$C$7\"),ISNUMBER(B484)),INDIRECT($B$1&\"!$C$16\")*ERFC(0.5*C484*SQRT(INDIRECT($B$1&\"!$F$10\")/(INDIRECT($B$1&\"!$F$9\")*INDIRECT($B$1&\"!$C$20\")*B484))),\"\")","v":""},{"$f":"(INDIRECT($B$1&\"!$F$15\") -D484)/C484","v":{"$error":"#VALUE!"}},{"$f":"IF(ISNUMBER(E484),E484*INDIRECT($B$1&\"!$F$9\")/$G$3,\"\")","v":""},"",{"$f":"IF(B484<INDIRECT($B$1&\"!$C$7\"),H483-G484,\"\")","v":""}]
[null,{"$f":"IF(ISNUMBER(B484),IF(AND(B484<INDIRECT($B$1&\"!$C$7\"),H484>0), B484+0.5,\"\"),\"\")","v":""},"",{"$f":"IF(AND(B485<INDIRECT($B$1&\"!$C$7\"),ISNUMBER(B485)),INDIRECT($B$1&\"!$C$16\")*ERFC(0.5*C485*SQRT(INDIRECT($B$1&\"!$F$10\")/(INDIRECT($B$1&\"!$F$9\")*INDIRECT($B$1&\"!$C$20\")*B485))),\"\")","v":""},{"$f":"(INDIRECT($B$1&\"!$F$15\") -D485)/C485","v":{"$error":"#VALUE!"}},{"$f":"IF(ISNUMBER(E485),E485*INDIRECT($B$1&\"!$F$9\")/$G$3,\"\")","v":""},"",{"$f":"IF(B485<INDIRECT($B$1&\"!$C$7\"),H484-G485,\"\")","v":""}]
[null,{"$f":"IF(ISNUMBER(B485),IF(AND(B485<INDIRECT($B$1&\"!$C$7\"),H485>0), B485+0.5,\"\"),\"\")","v":""},"",{"$f":"IF(AND(B486<INDIRECT($B$1&\"!$C$7\"),ISNUMBER(B486)),INDIRECT($B$1&\"!$C$16\")*ERFC(0.5*C486*SQRT(INDIRECT($B$1&\"!$F$10\")/(INDIRECT($B$1&\"!$F$9\")*INDIRECT($B$1&\"!$C$20\")*B486))),\"\")","v":""},{"$f":"(INDIRECT($B$1&\"!$F$15\") -D486)/C486","v":{"$error":"#VALUE!"}},{"$f":"IF(ISNUMBER(E486),E486*INDIRECT($B$1&\"!$F$9\")/$G$3,\"\")","v":""},"",{"$f":"IF(B486<INDIRECT($B$1&\"!$C$7\"),H485-G486,\"\")","v":""}]
[null,{"$f":"IF(ISNUMBER(B486),IF(AND(B486<INDIRECT($B$1&\"!$C$7\"),H486>0), B486+0.5,\"\"),\"\")","v":""},"",{"$f":"IF(AND(B487<INDIRECT($B$1&\"!$C$7\"),ISNUMBER(B487)),INDIRECT($B$1&\"!$C$16\")*ERFC(0.5*C487*SQRT(INDIRECT($B$1&\"!$F$10\")/(INDIRECT($B$1&\"!$F$9\")*INDIRECT($B$1&\"!$C$20\")*B487))),\"\")","v":""},{"$f":"(INDIRECT($B$1&\"!$F$15\") -D487)/C487","v":{"$error":"#VALUE!"}},{"$f":"IF(ISNUMBER(E487),E487*INDIRECT($B$1&\"!$F$9\")/$G$3,\"\")","v":""},"",{"$f":"IF(B487<INDIRECT($B$1&\"!$C$7\"),H486-G487,\"\")","v":""}]
[null,{"$f":"IF(ISNUMBER(B487),IF(AND(B487<INDIRECT($B$1&\"!$C$7\"),H487>0), B487+0.5,\"\"),\"\")","v":""},"",{"$f":"IF(AND(B488<INDIRECT($B$1&\"!$C$7\"),ISNUMBER(B488)),INDIRECT($B$1&\"!$C$16\")*ERFC(0.5*C488*SQRT(INDIRECT($B$1&\"!$F$10\")/(INDIRECT($B$1&\"!$F$9\")*INDIRECT($B$1&\"!$C$20\")*B488))),\"\")","v":""},{"$f":"(INDIRECT($B$1&\"!$F$15\") -D488)/C488","v":{"$error":"#VALUE!"}},{"$f":"IF(ISNUMBER(E488),E488*INDIRECT($B$1&\"!$F$9\")/$G$3,\"\")","v":""},"",{"$f":"IF(B488<INDIRECT($B$1&\"!$C$7\"),H487-G488,\"\")","v":""}]
[null,{"$f":"IF(ISNUMBER(B488),IF(AND(B488<INDIRECT($B$1&\"!$C$7\"),H488>0), B488+0.5,\"\"),\"\")","v":""},"",{"$f":"IF(AND(B489<INDIRECT($B$1&\"!$C$7\"),ISNUMBER(B489)),INDIRECT($B$1&\"!$C$16\")*ERFC(0.5*C489*SQRT(INDIRECT($B$1&\"!$F$10\")/(INDIRECT($B$1&\"!$F$9\")*INDIRECT($B$1&\"!$C$20\")*B489))),\"\")","v":""},{"$f":"(INDIRECT($B$1&\"!$F$15\") -D489)/C489","v":{"$error":"#VALUE!"}},{"$f":"IF(ISNUMBER(E489),E489*INDIRECT($B$1&\"!$F$9\")/$G$3,\"\")","v":""},"",{"$f":"IF(B489<INDIRECT($B$1&\"!$C$7\"),H488-G489,\"\")","v":""}]
[null,{"$f":"IF(ISNUMBER(B489),IF(AND(B489<INDIRECT($B$1&\"!$C$7\"),H489>0), B489+0.5,\"\"),\"\")","v":""},"",{"$f":"IF(AND(B490<INDIRECT($B$1&\"!$C$7\"),ISNUMBER(B490)),INDIRECT($B$1&\"!$C$16\")*ERFC(0.5*C490*SQRT(INDIRECT($B$1&\"!$F$10\")/(INDIRECT($B$1&\"!$F$9\")*INDIRECT($B$1&\"!$C$20\")*B490))),\"\")","v":""},{"$f":"(INDIRECT($B$1&\"!$F$15\") -D490)/C490","v":{"$error":"#VALUE!"}},{"$f":"IF(ISNUMBER(E490),E490*INDIRECT($B$1&\"!$F$9\")/$G$3,\"\")","v":""},"",{"$f":"IF(B490<INDIRECT($B$1&\"!$C$7\"),H489-G490,\"\")","v":""}]
[null,{"$f":"IF(ISNUMBER(B490),IF(AND(B490<INDIRECT($B$1&\"!$C$7\"),H490>0), B490+0.5,\"\"),\"\")","v":""},"",{"$f":"IF(AND(B491<INDIRECT($B$1&\"!$C$7\"),ISNUMBER(B491)),INDIRECT($B$1&\"!$C$16\")*ERFC(0.5*C491*SQRT(INDIRECT($B$1&\"!$F$10\")/(INDIRECT($B$1&\"!$F$9\")*INDIRECT($B$1&\"!$C$20\")*B491))),\"\")","v":""},{"$f":"(INDIRECT($B$1&\"!$F$15\") -D491)/C491","v":{"$error":"#VALUE!"}},{"$f":"IF(ISNUMBER(E491),E491*INDIRECT($B$1&\"!$F$9\")/$G$3,\"\")","v":""},"",{"$f":"IF(B491<INDIRECT($B$1&\"!$C$7\"),H490-G491,\"\")","v":""}]
[null,{"$f":"IF(ISNUMBER(B491),IF(AND(B491<INDIRECT($B$1&\"!$C$7\"),H491>0), B491+0.5,\"\"),\"\")","v":""},"",{"$f":"IF(AND(B492<INDIRECT($B$1&\"!$C$7\"),ISNUMBER(B492)),INDIRECT($B$1&\"!$C$16\")*ERFC(0.5*C492*SQRT(INDIRECT($B$1&\"!$F$10\")/(INDIRECT($B$1&\"!$F$9\")*INDIRECT($B$1&\"!$C$20\")*B492))),\"\")","v":""},{"$f":"(INDIRECT($B$1&\"!$F$15\") -D492)/C492","v":{"$error":"#VALUE!"}},{"$f":"IF(ISNUMBER(E492),E492*INDIRECT($B$1&\"!$F$9\")/$G$3,\"\")","v":""},"",{"$f":"IF(B492<INDIRECT($B$1&\"!$C$7\"),H491-G492,\"\")","v":""}]
[null,{"$f":"IF(ISNUMBER(B492),IF(AND(B492<INDIRECT($B$1&\"!$C$7\"),H492>0), B492+0.5,\"\"),\"\")","v":""},"",{"$f":"IF(AND(B493<INDIRECT($B$1&\"!$C$7\"),ISNUMBER(B493)),INDIRECT($B$1&\"!$C$16\")*ERFC(0.5*C493*SQRT(INDIRECT($B$1&\"!$F$10\")/(INDIRECT($B$1&\"!$F$9\")*INDIRECT($B$1&\"!$C$20\")*B493))),\"\")","v":""},{"$f":"(INDIRECT($B$1&\"!$F$15\") -D493)/C493","v":{"$error":"#VALUE!"}},{"$f":"IF(ISNUMBER(E493),E493*INDIRECT($B$1&\"!$F$9\")/$G$3,\"\")","v":""},"",{"$f":"IF(B493<INDIRECT($B$1&\"!$C$7\"),H492-G493,\"\")","v":""}]
[null,{"$f":"IF(ISNUMBER(B493),IF(AND(B493<INDIRECT($B$1&\"!$C$7\"),H493>0), B493+0.5,\"\"),\"\")","v":""},"",{"$f":"IF(AND(B494<INDIRECT($B$1&\"!$C$7\"),ISNUMBER(B494)),INDIRECT($B$1&\"!$C$16\")*ERFC(0.5*C494*SQRT(INDIRECT($B$1&\"!$F$10\")/(INDIRECT($B$1&\"!$F$9\")*INDIRECT($B$1&\"!$C$20\")*B494))),\"\")","v":""},{"$f":"(INDIRECT($B$1&\"!$F$15\") -D494)/C494","v":{"$error":"#VALUE!"}},{"$f":"IF(ISNUMBER(E494),E494*INDIRECT($B$1&\"!$F$9\")/$G$3,\"\")","v":""},"",{"$f":"IF(B494<INDIRECT($B$1&\"!$C$7\"),H493-G494,\"\")","v":""}]
[null,{"$f":"IF(ISNUMBER(B494),IF(AND(B494<INDIRECT($B$1&\"!$C$7\"),H494>0), B494+0.5,\"\"),\"\")","v":""},"",{"$f":"IF(AND(B495<INDIRECT($B$1&\"!$C$7\"),ISNUMBER(B495)),INDIRECT($B$1&\"!$C$16\")*ERFC(0.5*C495*SQRT(INDIRECT($B$1&\"!$F$10\")/(INDIRECT($B$1&\"!$F$9\")*INDIRECT($B$1&\"!$C$20\")*B495))),\"\")","v":""},{"$f":"(INDIRECT($B$1&\"!$F$15\") -D495)/C495","v":{"$error":"#VALUE!"}},{"$f":"IF(ISNUMBER(E495),E495*INDIRECT($B$1&\"!$F$9\")/$G$3,\"\")","v":""},"",{"$f":"IF(B495<INDIRECT($B$1&\"!$C$7\"),H494-G495,\"\")","v":""}]
[null,{"$f":"IF(ISNUMBER(B495),IF(AND(B495<INDIRECT($B$1&\"!$C$7\"),H495>0), B495+0.5,\"\"),\"\")","v":""},"",{"$f":"IF(AND(B496<INDIRECT($B$1&\"!$C$7\"),ISNUMBER(B496)),INDIRECT($B$1&\"!$C$16\")*ERFC(0.5*C496*SQRT(INDIRECT($B$1&\"!$F$10\")/(INDIRECT($B$1&\"!$F$9\")*INDIRECT($B$1&\"!$C$20\")*B496))),\"\")","v":""},{"$f":"(INDIRECT($B$1&\"!$F$15\") -D496)/C496","v":{"$error":"#VALUE!"}},{"$f":"IF(ISNUMBER(E496),E496*INDIRECT($B$1&\"!$F$9\")/$G$3,\"\")","v":""},"",{"$f":"IF(B496<INDIRECT($B$1&\"!$C$7\"),H495-G496,\"\")","v":""}]
[null,{"$f":"IF(ISNUMBER(B496),IF(AND(B496<INDIRECT($B$1&\"!$C$7\"),H496>0), B496+0.5,\"\"),\"\")","v":""},{"$f":"IF(ISNUMBER(B497),H496,\"\")","v":""},{"$f":"IF(AND(B497<INDIRECT($B$1&\"!$C$7\"),ISNUMBER(B497)),INDIRECT($B$1&\"!$C$16\")*ERFC(0.5*C497*SQRT(INDIRECT($B$1&\"!$F$10\")/(INDIRECT($B$1&\"!$F$9\")*INDIRECT($B$1&\"!$C$20\")*B497))),\"\")","v":""},{"$f":"(INDIRECT($B$1&\"!$F$15\") -D497)/C497","v":{"$error":"#VALUE!"}},{"$f":"IF(ISNUMBER(E497),E497*INDIRECT($B$1&\"!$F$9\")/$G$3,\"\")","v":""},{"$f":"IF(ISNUMBER(F497),F497*ABS(B496-B497)/$I$3,\"\")","v":""},{"$f":"IF(B497<INDIRECT($B$1&\"!$C$7\"),H496-G497,\"\")","v":""}]
[null,{"$f":"IF(ISNUMBER(B497),IF(AND(B497<INDIRECT($B$1&\"!$C$7\"),H497>0), B497+0.5,\"\"),\"\")","v":""},"",{"$f":"IF(AND(B498<INDIRECT($B$1&\"!$C$7\"),ISNUMBER(B498)),INDIRECT($B$1&\"!$C$16\")*ERFC(0.5*C498*SQRT(INDIRECT($B$1&\"!$F$10\")/(INDIRECT($B$1&\"!$F$9\")*INDIRECT($B$1&\"!$C$20\")*B498))),\"\")","v":""},{"$f":"(INDIRECT($B$1&\"!$F$15\") -D498)/C498","v":{"$error":"#VALUE!"}},{"$f":"IF(ISNUMBER(E498),E498*INDIRECT($B$1&\"!$F$9\")/$G$3,\"\")","v":""},"",{"$f":"IF(B498<INDIRECT($B$1&\"!$C$7\"),H497-G498,\"\")","v":""}]
[null,{"$f":"IF(ISNUMBER(B498),IF(AND(B498<INDIRECT($B$1&\"!$C$7\"),H498>0), B498+0.5,\"\"),\"\")","v":""},"",{"$f":"IF(AND(B499<INDIRECT($B$1&\"!$C$7\"),ISNUMBER(B499)),INDIRECT($B$1&\"!$C$16\")*ERFC(0.5*C499*SQRT(INDIRECT($B$1&\"!$F$10\")/(INDIRECT($B$1&\"!$F$9\")*INDIRECT($B$1&\"!$C$20\")*B499))),\"\")","v":""},{"$f":"(INDIRECT($B$1&\"!$F$15\") -D499)/C499","v":{"$error":"#VALUE!"}},{"$f":"IF(ISNUMBER(E499),E499*INDIRECT($B$1&\"!$F$9\")/$G$3,\"\")","v":""},"",{"$f":"IF(B499<INDIRECT($B$1&\"!$C$7\"),H498-G499,\"\")","v":""}]
[null,{"$f":"IF(ISNUMBER(B499),IF(AND(B499<INDIRECT($B$1&\"!$C$7\"),H499>0), B499+0.5,\"\"),\"\")","v":""},"",{"$f":"IF(AND(B500<INDIRECT($B$1&\"!$C$7\"),ISNUMBER(B500)),INDIRECT($B$1&\"!$C$16\")*ERFC(0.5*C500*SQRT(INDIRECT($B$1&\"!$F$10\")/(INDIRECT($B$1&\"!$F$9\")*INDIRECT($B$1&\"!$C$20\")*B500))),\"\")","v":""},{"$f":"(INDIRECT($B$1&\"!$F$15\") -D500)/C500","v":{"$error":"#VALUE!"}},{"$f":"IF(ISNUMBER(E500),E500*INDIRECT($B$1&\"!$F$9\")/$G$3,\"\")","v":""},"",{"$f":"IF(B500<INDIRECT($B$1&\"!$C$7\"),H499-G500,\"\")","v":""}]
[null,{"$f":"IF(ISNUMBER(B500),IF(AND(B500<INDIRECT($B$1&\"!$C$7\"),H500>0), B500+0.5,\"\"),\"\")","v":""},"",{"$f":"IF(AND(B501<INDIRECT($B$1&\"!$C$7\"),ISNUMBER(B501)),INDIRECT($B$1&\"!$C$16\")*ERFC(0.5*C501*SQRT(INDIRECT($B$1&\"!$F$10\")/(INDIRECT($B$1&\"!$F$9\")*INDIRECT($B$1&\"!$C$20\")*B501))),\"\")","v":""},{"$f":"(INDIRECT($B$1&\"!$F$15\") -D501)/C501","v":{"$error":"#VALUE!"}},{"$f":"IF(ISNUMBER(E501),E501*INDIRECT($B$1&\"!$F$9\")/$G$3,\"\")","v":""},"",{"$f":"IF(B501<INDIRECT($B$1&\"!$C$7\"),H500-G501,\"\")","v":""}]
[null,{"$f":"IF(ISNUMBER(B501),IF(AND(B501<INDIRECT($B$1&\"!$C$7\"),H501>0), B501+0.5,\"\"),\"\")","v":""},"",{"$f":"IF(AND(B502<INDIRECT($B$1&\"!$C$7\"),ISNUMBER(B502)),INDIRECT($B$1&\"!$C$16\")*ERFC(0.5*C502*SQRT(INDIRECT($B$1&\"!$F$10\")/(INDIRECT($B$1&\"!$F$9\")*INDIRECT($B$1&\"!$C$20\")*B502))),\"\")","v":""},{"$f":"(INDIRECT($B$1&\"!$F$15\") -D502)/C502","v":{"$error":"#VALUE!"}},{"$f":"IF(ISNUMBER(E502),E502*INDIRECT($B$1&\"!$F$9\")/$G$3,\"\")","v":""},"",{"$f":"IF(B502<INDIRECT($B$1&\"!$C$7\"),H501-G502,\"\")","v":""}]

{"sheet":"Versies","index":5,"n_rows":17,"n_cols":2,"rows_kept":17,"cut":false,"hidden":false,"merged":[]}
["versies"]
["v1.0 20/10/2021","Versie zoals gepubliceerd op website VMM op 20/10/2021"]
[null,"Handleiding is in overeenstemming met deze versie"]
["v1.1 08/06/2022","Versie zoals gepubliceerd op website VMM op 10/06/2022"]
[null,"aanpassing cel B18 tabblad INPUT-OUTPUT"]
[null,"aanpassing bepalen rubriek en vergunningsklasse in tabblad SAMENVATTING"]
["V2.0 03/03/2025","aanpassingen aan nieuwe indelingsrubrieken volgens de grondwatertrein"]
[null,"kleine correcties in waarschuwingen"]
[null,"toevoeging waarschuwing ivm passende beoordeling en verscherpte natuurtoets"]
["v2.0 06/03/2025","geen meldingen over passende beoordeling bij niet-ingedeelde inrichting of klasse 3"]
[null,"geen meldingen over VEN-gebied bij niet-ingedeelde inrichting"]
[null,"link naar huidige rubriekenlijst en naar versie dd. 08/04/2025"]
[null,"tekening filter aangepast en verbetering aanduiding H"]
["v2.0 25/03/2025","macro van samenvatting volledig afgewerkt en aangepast aan nieuwe wetgeving, waarschuwingen aangepast in tabblad IN_OUTPUT"]
["v2.0 28/03/2025","link naar website VMM aangepast"]
[null,"Handleiding is in overeenstemming met deze versie"]
["v2.1 14/5/2025","kleine aanpassing in in-output tabblad"]